program: Orca
programVersion: 5.0.4
elementType: O O O O O O C C C C C C C C C C C C C C C C C C C C C C C C C C H H H H H H H H H H H H H H H H H H H H H H H H H H H H
charge: 0
multiplicity: 1
keywords: wb97x-d3
keywords: def2-TZVPP
keywords: def2/J RIJCOSX
keywords: DEFGRID2
keywords: scfconv7
keywords: smallprint printgap noloewdin
keywords: NOSOSCF
formula: C26H28O6
InChI: InChI=1/C26H28O6/c1-5-6-10-21-17(2)20-13-12-19(14-24(20)32-26(21)28)31-15-18-9-7-8-11-22(18)23(16-29-3)25(27)30-4/h7-9,11-14,16H,5-6,10,15H2,1-4H3
60 atoms
O  1.736526 -0.763575 0.682777
O  -1.726531 2.42939 1.149114
O  3.212695 -2.325767 0.345062
O  -5.206798 -0.453736 0.671293
O  -1.151887 -2.377655 -0.528928
O  -4.583941 -2.318497 1.730569
C  5.485833 -0.60644 0.56248
C  4.065046 -0.14303 0.734631
C  6.072666 -0.258568 -0.809699
C  3.717724 1.147569 0.9875
C  2.320646 1.511269 1.058462
C  5.321693 -0.858001 -1.99127
C  1.364643 0.516428 0.891795
C  3.030214 -1.150729 0.569167
C  4.727364 2.231374 1.182705
C  1.845645 2.816209 1.260633
C  0.000349 0.762995 0.921712
C  -0.435519 2.064653 1.111842
C  0.500532 3.094805 1.28406
C  5.962828 -0.495743 -3.322537
C  -2.731375 1.458173 0.892124
C  -2.778344 1.043973 -0.557922
C  -3.0067 -0.283707 -0.938064
C  -2.611462 2.016093 -1.541568
C  -3.051491 -0.601208 -2.29583
C  -3.176113 -1.374324 0.052001
C  -2.654342 1.686671 -2.886393
C  -2.875005 0.370563 -3.26646
C  -4.365878 -1.456451 0.906206
C  -2.264512 -2.357878 0.182228
C  -6.406509 -0.40947 1.439724
C  -0.27153 -3.476988 -0.30642
H  6.115665 -0.168092 1.338896
H  5.540783 -1.684843 0.713476
H  7.112111 -0.600481 -0.832304
H  6.108955 0.829603 -0.924869
H  5.280592 -1.946239 -1.887969
H  4.284392 -0.509878 -1.98878
H  4.541765 2.766913 2.115318
H  5.747027 1.860239 1.213515
H  4.666049 2.965739 0.376983
H  2.544927 3.630453 1.393014
H  -0.676507 -0.067552 0.787901
H  0.154711 4.109596 1.432859
H  5.991787 0.586419 -3.467714
H  5.411396 -0.923009 -4.161533
H  6.989774 -0.861917 -3.384765
H  -2.606297 0.599826 1.558141
H  -3.663229 1.949689 1.175124
H  -2.439574 3.046912 -1.256441
H  -3.23369 -1.62693 -2.592111
H  -2.519388 2.457031 -3.634748
H  -2.912114 0.101177 -4.314158
H  -2.418201 -3.167804 0.892189
H  -6.19917 -0.307269 2.505498
H  -6.947832 0.468688 1.096997
H  -7.022287 -1.294282 1.275743
H  -0.74413 -4.416587 -0.595789
H  0.602478 -3.313863 -0.930118
H  0.037907 -3.53355 0.737879
elementType: O C H
totalener: -1459.13833587 hartree
nucrepener: 3269.67121117 hartree
electener: -4728.80954704 hartree
oneelecener: -8490.76119351 hartree
twoeener: 3761.95164646 hartree
cpcmener: -0.03964970 hartree
kineticenergy: 1452.83406682 hartree
xcener: -140.268030223749 hartree
chargesum: -0.0000000
charge: -0.243802 -0.322151 -0.471760 -0.283654 -0.286138 -0.489907 -0.126850 0.001113 -0.145715 0.012539 -0.043346 -0.075470 0.102839 0.382276 -0.305979 -0.098530 -0.119500 0.293710 -0.262949 -0.283710 0.086789 -0.140102 0.062732 -0.148571 -0.208280 -0.174049 -0.165308 -0.155106 0.494024 0.251410 -0.139179 -0.145959 0.099192 0.093047 0.076846 0.070407 0.060604 0.059751 0.114888 0.100421 0.123239 0.154042 0.116999 0.137680 0.077941 0.090493 0.079619 0.128138 0.124142 0.138285 0.142084 0.156971 0.156440 0.110778 0.116040 0.124240 0.119795 0.135223 0.120818 0.120464
qa: -0.2438 -0.3222 -0.4718 -0.2837 -0.2861 -0.4899 -0.1269 0.0011 -0.1457 0.0125 -0.0433 -0.0755 0.1028 0.3823 -0.3060 -0.0985 -0.1195 0.2937 -0.2629 -0.2837 0.0868 -0.1401 0.0627 -0.1486 -0.2083 -0.1740 -0.1653 -0.1551 0.4940 0.2514 -0.1392 -0.1460 0.0992 0.0930 0.0768 0.0704 0.0606 0.0598 0.1149 0.1004 0.1232 0.1540 0.1170 0.1377 0.0779 0.0905 0.0796 0.1281 0.1241 0.1383 0.1421 0.1570 0.1564 0.1108 0.1160 0.1242 0.1198 0.1352 0.1208 0.1205
va: 2.2085 2.0885 2.0388 2.1200 2.1168 2.0287 3.8462 3.4633 3.8836 3.6885 3.7583 3.8428 4.1521 4.2158 3.9440 3.8929 3.8070 3.8116 4.0592 3.9562 3.7960 3.6501 3.4732 3.9016 3.9780 3.4538 3.9135 3.9033 4.1229 3.9270 3.8750 3.8490 1.0019 1.0267 1.0119 1.0022 1.0112 1.0083 0.9965 1.0074 0.9904 0.9935 1.0267 1.0147 1.0006 1.0032 1.0008 0.9956 0.9919 1.0138 1.0071 0.9911 0.9915 1.0300 0.9931 0.9956 0.9939 0.9886 1.0004 0.9894
dispcorr: -0.032885756 hartree
energy: -1459.171221628912
dipole: 27.79478 -27.32698 0.46780 1.10335 0.91716 2.02051 -11.00365 10.89570 -0.10795
magnitude: 2.07676 au
magnitude: 5.27872 debye
