program: Orca
programVersion: 5.0.4
elementType: O O O O O O C C C C C C C C C C C C C C C C C C C C C C C C C C H H H H H H H H H H H H H H H H H H H H H H H H H H H H
charge: 0
multiplicity: 1
keywords: wb97x-d3
keywords: def2-TZVPP
keywords: def2/J RIJCOSX
keywords: DEFGRID2
keywords: scfconv7
keywords: smallprint printgap noloewdin
keywords: NOSOSCF
formula: C26H28O6
InChI: InChI=1/C26H28O6/c1-5-6-10-21-17(2)20-13-12-19(14-24(20)32-26(21)28)31-15-18-9-7-8-11-22(18)23(16-29-3)25(27)30-4/h7-9,11-14,16H,5-6,10,15H2,1-4H3
60 atoms
O  2.29163 -1.277241 -1.178519
O  -1.784466 0.588043 -2.373896
O  4.124269 -2.347601 -0.687854
O  -1.183663 -0.716116 1.255187
O  -4.695077 -1.137226 -1.760373
O  -1.506222 -2.701821 0.288529
C  5.239193 -0.294616 0.919145
C  3.909034 -0.174111 0.232737
C  5.11489 -0.878725 2.327575
C  3.084796 0.899163 0.3525
C  1.818238 0.904707 -0.345348
C  6.450616 -1.017282 3.050379
C  1.463998 -0.212526 -1.100434
C  3.491453 -1.326954 -0.550592
C  3.417626 2.08596 1.196413
C  0.905094 1.962305 -0.314076
C  0.262816 -0.305285 -1.776465
C  -0.629954 0.757492 -1.711765
C  -0.297688 1.906563 -0.986299
C  7.155564 0.307174 3.308392
C  -2.863184 1.475252 -2.1469
C  -3.352639 1.559996 -0.720244
C  -3.403984 0.475631 0.164387
C  -3.805078 2.806677 -0.289874
C  -3.894518 0.685026 1.455163
C  -2.982967 -0.897262 -0.202363
C  -4.304303 2.996283 0.98727
C  -4.343906 1.926592 1.869647
C  -1.83871 -1.546023 0.450247
C  -3.64083 -1.620252 -1.124247
C  -0.061794 -1.237984 1.961931
C  -5.25628 -1.960723 -2.776904
H  5.902858 -0.926679 0.32601
H  5.720388 0.682868 0.957173
H  4.637116 -1.860358 2.262739
H  4.442398 -0.250549 2.921342
H  6.277341 -1.520659 4.005337
H  7.108207 -1.677832 2.476682
H  2.669087 2.212827 1.981276
H  4.386088 2.006178 1.680772
H  3.415373 3.002523 0.603788
H  1.136338 2.856418 0.248687
H  0.015611 -1.199119 -2.336114
H  -0.961843 2.757118 -0.936046
H  7.452735 0.805593 2.384434
H  8.062507 0.161343 3.897324
H  6.513663 0.99683 3.861573
H  -2.608652 2.479944 -2.500496
H  -3.659698 1.112044 -2.798258
H  -3.753606 3.649186 -0.970396
H  -3.937289 -0.151614 2.141961
H  -4.64765 3.975703 1.294565
H  -4.722192 2.056986 2.87526
H  -3.326866 -2.630765 -1.375288
H  -0.365422 -1.998482 2.683012
H  0.686896 -1.663122 1.29313
H  0.372265 -0.397697 2.497576
H  -5.578494 -2.922806 -2.374312
H  -6.1226 -1.432493 -3.167159
H  -4.54536 -2.126348 -3.588047
elementType: O C H
totalener: -1459.13383585 hartree
nucrepener: 3333.12471218 hartree
electener: -4792.25854803 hartree
oneelecener: -8617.87065535 hartree
twoeener: 3825.61210732 hartree
cpcmener: -0.04667282 hartree
kineticenergy: 1452.85327129 hartree
xcener: -140.274298308111 hartree
chargesum: -0.0000000
charge: -0.233480 -0.318192 -0.451945 -0.274193 -0.291618 -0.488100 -0.127107 -0.004751 -0.130884 -0.012950 -0.052492 -0.108315 0.153169 0.397554 -0.283450 -0.115788 -0.257196 0.314498 -0.209006 -0.282794 0.106597 -0.173364 0.092276 -0.123742 -0.228397 -0.128982 -0.171903 -0.149654 0.437711 0.235227 -0.150018 -0.130797 0.090446 0.097919 0.085130 0.076738 0.068937 0.058762 0.117154 0.095133 0.116493 0.153008 0.129749 0.138600 0.080614 0.094973 0.080479 0.118610 0.121976 0.138589 0.140671 0.156725 0.156805 0.107043 0.136127 0.109380 0.124370 0.122789 0.122080 0.122788
qa: -0.2335 -0.3182 -0.4519 -0.2742 -0.2916 -0.4881 -0.1271 -0.0048 -0.1309 -0.0129 -0.0525 -0.1083 0.1532 0.3976 -0.2835 -0.1158 -0.2572 0.3145 -0.2090 -0.2828 0.1066 -0.1734 0.0923 -0.1237 -0.2284 -0.1290 -0.1719 -0.1497 0.4377 0.2352 -0.1500 -0.1308 0.0904 0.0979 0.0851 0.0767 0.0689 0.0588 0.1172 0.0951 0.1165 0.1530 0.1297 0.1386 0.0806 0.0950 0.0805 0.1186 0.1220 0.1386 0.1407 0.1567 0.1568 0.1070 0.1361 0.1094 0.1244 0.1228 0.1221 0.1228
va: 2.1671 2.0761 2.0652 2.1001 2.1272 2.0209 3.8229 3.3484 3.8565 3.7181 3.6294 3.8829 3.9312 4.3005 3.9558 3.9129 3.9792 3.7909 3.9125 3.9274 3.7305 3.7142 3.3545 3.8654 3.9941 3.4642 3.9218 3.9016 4.1616 3.9771 3.8716 3.8572 1.0245 0.9974 1.0193 1.0085 1.0077 1.0084 0.9928 1.0073 0.9963 0.9957 1.0282 1.0140 0.9984 1.0050 1.0006 0.9980 0.9949 1.0018 1.0094 0.9910 0.9914 1.0282 0.9972 0.9940 0.9931 0.9866 0.9942 0.9855
dispcorr: -0.035927417 hartree
energy: -1459.169763262311
dipole: 22.98658 -25.16574 -2.17916 7.50966 -4.26153 3.24812 19.02194 -18.64087 0.38107
magnitude: 3.92992 au
magnitude: 9.98906 debye
