program: Orca
programVersion: 5.0.4
elementType: O O O O O O C C C C C C C C C C C C C C C C C C C C C C C C C C H H H H H H H H H H H H H H H H H H H H H H H H H H H H
charge: 0
multiplicity: 1
keywords: wb97x-d3
keywords: def2-TZVPP
keywords: def2/J RIJCOSX
keywords: DEFGRID2
keywords: scfconv7
keywords: smallprint printgap noloewdin
keywords: NOSOSCF
formula: C26H28O6
InChI: InChI=1/C26H28O6/c1-5-6-10-21-17(2)20-13-12-19(14-24(20)32-26(21)28)31-15-18-9-7-8-11-22(18)23(16-29-3)25(27)30-4/h7-9,11-14,16H,5-6,10,15H2,1-4H3
60 atoms
O  2.288985 -1.256681 -1.199879
O  -1.792832 0.604351 -2.380981
O  4.124792 -2.325052 -0.717557
O  -1.162927 -0.703156 1.260101
O  -4.664201 -1.152766 -1.764533
O  -1.465333 -2.688813 0.287292
C  5.220842 -0.294125 0.927849
C  3.896369 -0.165562 0.23231
C  5.084916 -0.908241 2.32238
C  3.068223 0.903657 0.361047
C  1.805715 0.914343 -0.34417
C  6.41491 -1.065562 3.051812
C  1.457313 -0.195955 -1.112052
C  3.486822 -1.309248 -0.568653
C  3.391231 2.079587 1.223728
C  0.889605 1.969132 -0.305544
C  0.257652 -0.286366 -1.791057
C  -0.638937 0.772502 -1.717363
C  -0.311246 1.916281 -0.981474
C  7.122234 0.251065 3.341641
C  -2.875409 1.483836 -2.143576
C  -3.360504 1.556891 -0.714705
C  -3.394815 0.470226 0.16814
C  -3.82657 2.79716 -0.280049
C  -3.882804 0.67174 1.461296
C  -2.9582 -0.897035 -0.201664
C  -4.32286 2.978578 0.999313
C  -4.345575 1.906921 1.879932
C  -1.808971 -1.536615 0.451571
C  -3.606178 -1.624984 -1.126751
C  -0.038621 -1.217767 1.968457
C  -5.217062 -1.983959 -2.779511
H  5.892806 -0.910812 0.32784
H  5.697543 0.684153 0.99156
H  4.605745 -1.887285 2.233098
H  4.409162 -0.291371 2.924277
H  6.233343 -1.587834 3.995008
H  7.074491 -1.716318 2.469263
H  4.355695 1.995266 1.715226
H  3.391854 3.00427 0.643834
H  2.635723 2.193959 2.003876
H  1.116696 2.858455 0.266404
H  0.014491 -1.175639 -2.359657
H  -0.977979 2.764452 -0.925094
H  6.478549 0.93155 3.904001
H  7.427616 0.766909 2.429977
H  8.024489 0.090399 3.933908
H  -2.62736 2.492325 -2.490968
H  -3.67247 1.121296 -2.794648
H  -3.787942 3.641456 -0.959214
H  -3.912645 -0.166352 2.146989
H  -4.676965 3.953185 1.309681
H  -4.721079 2.030845 2.887396
H  -3.280387 -2.631423 -1.379057
H  0.388846 -0.374913 2.50536
H  -0.338495 -1.980686 2.688536
H  0.71374 -1.637873 1.3007
H  -5.530208 -2.948091 -2.374703
H  -6.088179 -1.464949 -3.171415
H  -4.504143 -2.144761 -3.589869
elementType: O C H
totalener: -1459.13377253 hartree
nucrepener: 3336.61980445 hartree
electener: -4795.75357698 hartree
oneelecener: -8624.86488558 hartree
twoeener: 3829.11130861 hartree
cpcmener: -0.04668011 hartree
kineticenergy: 1452.85317450 hartree
xcener: -140.274493032518 hartree
chargesum: 0.0000000
charge: -0.233445 -0.318210 -0.451918 -0.274690 -0.291573 -0.488231 -0.126182 -0.005330 -0.130715 -0.013967 -0.057798 -0.108835 0.159999 0.397635 -0.282915 -0.114488 -0.258323 0.315519 -0.210387 -0.282431 0.105637 -0.173309 0.092604 -0.123707 -0.229010 -0.128873 -0.172442 -0.149524 0.438562 0.235668 -0.149426 -0.130719 0.090534 0.097564 0.085182 0.076610 0.068919 0.058872 0.095289 0.116564 0.116811 0.153039 0.129693 0.138646 0.080477 0.080586 0.094734 0.118622 0.122020 0.138528 0.140530 0.156692 0.156760 0.107134 0.124133 0.136386 0.108904 0.122842 0.121998 0.122755
qa: -0.2334 -0.3182 -0.4519 -0.2747 -0.2916 -0.4882 -0.1262 -0.0053 -0.1307 -0.0140 -0.0578 -0.1088 0.1600 0.3976 -0.2829 -0.1145 -0.2583 0.3155 -0.2104 -0.2824 0.1056 -0.1733 0.0926 -0.1237 -0.2290 -0.1289 -0.1724 -0.1495 0.4386 0.2357 -0.1494 -0.1307 0.0905 0.0976 0.0852 0.0766 0.0689 0.0589 0.0953 0.1166 0.1168 0.1530 0.1297 0.1386 0.0805 0.0806 0.0947 0.1186 0.1220 0.1385 0.1405 0.1567 0.1568 0.1071 0.1241 0.1364 0.1089 0.1228 0.1220 0.1228
va: 2.1679 2.0758 2.0653 2.1002 2.1278 2.0207 3.8226 3.3508 3.8557 3.7160 3.6293 3.8836 3.9283 4.3004 3.9556 3.9110 3.9801 3.7869 3.9120 3.9275 3.7322 3.7130 3.3536 3.8658 3.9939 3.4641 3.9221 3.9013 4.1621 3.9755 3.8720 3.8573 1.0243 0.9976 1.0194 1.0085 1.0077 1.0084 1.0074 0.9963 0.9929 0.9956 1.0282 1.0139 1.0006 0.9984 1.0050 0.9979 0.9949 1.0018 1.0095 0.9911 0.9915 1.0283 0.9931 0.9972 0.9939 0.9866 0.9942 0.9855
dispcorr: -0.036036375 hartree
energy: -1459.169808899901
dipole: 22.80392 -25.00070 -2.19678 7.16954 -3.95302 3.21652 19.26126 -18.84172 0.41954
magnitude: 3.91763 au
magnitude: 9.95783 debye
