program: Orca
programVersion: 5.0.4
elementType: O O O O O O C C C C C C C C C C C C C C C C C C C C C C C C C C H H H H H H H H H H H H H H H H H H H H H H H H H H H H
charge: 0
multiplicity: 1
keywords: wb97x-d3
keywords: def2-TZVPP
keywords: def2/J RIJCOSX
keywords: DEFGRID2
keywords: scfconv7
keywords: smallprint printgap noloewdin
keywords: NOSOSCF
formula: C26H28O6
InChI: InChI=1/C26H28O6/c1-5-6-10-21-17(2)20-13-12-19(14-24(20)32-26(21)28)31-15-18-9-7-8-11-22(18)23(16-29-3)25(27)30-4/h7-9,11-14,16H,5-6,10,15H2,1-4H3
60 atoms
O  2.253931 -1.199496 -1.253363
O  -1.824711 0.688524 -2.402813
O  4.085522 -2.281327 -0.786097
O  -1.107656 -0.6483 1.306087
O  -4.464354 -1.19221 -1.865693
O  -1.296508 -2.628768 0.295888
C  5.141921 -0.325313 0.96771
C  3.836341 -0.162042 0.245158
C  4.96575 -1.016166 2.321855
C  3.006906 0.903009 0.397599
C  1.757646 0.940897 -0.330197
C  6.274179 -1.22271 3.077126
C  1.419508 -0.143677 -1.138441
C  3.442175 -1.273773 -0.607024
C  3.31045 2.04294 1.313988
C  0.839727 1.992906 -0.266608
C  0.225964 -0.214551 -1.830614
C  -0.673947 0.838813 -1.728892
C  -0.355038 1.959424 -0.954533
C  6.976419 0.071857 3.462367
C  -2.916037 1.541172 -2.118775
C  -3.397048 1.544467 -0.686202
C  -3.368609 0.438944 0.174473
C  -3.930761 2.74782 -0.225105
C  -3.868911 0.588249 1.470855
C  -2.848838 -0.8936 -0.214534
C  -4.436378 2.87602 1.056518
C  -4.400296 1.786139 1.914319
C  -1.694199 -1.494927 0.466429
C  -3.410677 -1.623416 -1.193266
C  0.015377 -1.127191 2.041515
C  -4.89975 -2.005111 -2.950577
H  5.832276 -0.907192 0.353798
H  5.614269 0.64797 1.100142
H  4.483817 -1.985268 2.164828
H  4.276909 -0.42916 2.93873
H  6.06517 -1.798251 3.98289
H  6.947699 -1.841114 2.475595
H  4.264197 1.939042 1.822307
H  3.322203 2.990857 0.77301
H  2.537872 2.124353 2.0816
H  1.059402 2.863199 0.336565
H  -0.011339 -1.08613 -2.428318
H  -1.025237 2.80325 -0.875698
H  6.318972 0.720713 4.045712
H  7.307368 0.638477 2.590592
H  7.862032 -0.12611 4.068332
H  -2.682365 2.567858 -2.420216
H  -3.713046 1.200496 -2.781694
H  -3.938932 3.606593 -0.886942
H  -3.853029 -0.263248 2.14021
H  -4.844233 3.822919 1.38612
H  -4.78315 1.867335 2.923359
H  -3.014922 -2.600229 -1.461865
H  0.805448 -1.503531 1.391286
H  0.389506 -0.276166 2.604771
H  -0.273675 -1.914326 2.739603
H  -5.127976 -3.019714 -2.618729
H  -5.804899 -1.54882 -3.343234
H  -4.147724 -2.042002 -3.7405
elementType: O C H
totalener: -1459.13335152 hartree
nucrepener: 3352.57866521 hartree
electener: -4811.71201673 hartree
oneelecener: -8656.77019166 hartree
twoeener: 3845.05817493 hartree
cpcmener: -0.04676854 hartree
kineticenergy: 1452.85054941 hartree
xcener: -140.274968896627 hartree
chargesum: 0.0000000
charge: -0.234030 -0.318981 -0.451722 -0.274985 -0.290905 -0.488362 -0.126434 -0.006805 -0.130731 -0.020633 -0.078644 -0.108315 0.191576 0.399000 -0.280869 -0.111035 -0.270359 0.328960 -0.216992 -0.281725 0.106876 -0.177342 0.087323 -0.124905 -0.227775 -0.124443 -0.174692 -0.149099 0.439673 0.237489 -0.145659 -0.129269 0.090938 0.097267 0.085845 0.075960 0.068675 0.058713 0.095802 0.117001 0.115909 0.153030 0.130084 0.137729 0.080364 0.080211 0.094397 0.118958 0.121885 0.137215 0.139764 0.156697 0.156471 0.107512 0.105568 0.123899 0.136615 0.122245 0.122090 0.122965
qa: -0.2340 -0.3190 -0.4517 -0.2750 -0.2909 -0.4884 -0.1264 -0.0068 -0.1307 -0.0206 -0.0786 -0.1083 0.1916 0.3990 -0.2809 -0.1110 -0.2704 0.3290 -0.2170 -0.2817 0.1069 -0.1773 0.0873 -0.1249 -0.2278 -0.1244 -0.1747 -0.1491 0.4397 0.2375 -0.1457 -0.1293 0.0909 0.0973 0.0858 0.0760 0.0687 0.0587 0.0958 0.1170 0.1159 0.1530 0.1301 0.1377 0.0804 0.0802 0.0944 0.1190 0.1219 0.1372 0.1398 0.1567 0.1565 0.1075 0.1056 0.1239 0.1366 0.1222 0.1221 0.1230
va: 2.1708 2.0739 2.0656 2.1003 2.1295 2.0208 3.8226 3.3569 3.8546 3.7164 3.6361 3.8856 3.9120 4.3000 3.9552 3.9024 3.9814 3.7689 3.9191 3.9279 3.7329 3.7073 3.3624 3.8736 3.9894 3.4583 3.9230 3.8992 4.1650 3.9682 3.8735 3.8559 1.0241 0.9978 1.0191 1.0089 1.0078 1.0084 1.0075 0.9962 0.9931 0.9951 1.0271 1.0131 1.0005 0.9985 1.0051 0.9974 0.9944 1.0021 1.0103 0.9911 0.9916 1.0281 0.9927 0.9932 0.9973 0.9871 0.9940 0.9858
dispcorr: -0.036534993 hartree
energy: -1459.169886512345
dipole: 22.44365 -24.59957 -2.15591 6.20735 -3.05250 3.15485 19.83459 -19.36534 0.46925
magnitude: 3.84983 au
magnitude: 9.78550 debye
