program: Orca
programVersion: 5.0.4
elementType: O O O O O O C C C C C C C C C C C C C C C C C C C C C C C C C C H H H H H H H H H H H H H H H H H H H H H H H H H H H H
charge: 0
multiplicity: 1
keywords: wb97x-d3
keywords: def2-TZVPP
keywords: def2/J RIJCOSX
keywords: DEFGRID2
keywords: scfconv7
keywords: smallprint printgap noloewdin
keywords: NOSOSCF
formula: C26H28O6
InChI: InChI=1/C26H28O6/c1-5-6-10-21-17(2)20-13-12-19(14-24(20)32-26(21)28)31-15-18-9-7-8-11-22(18)23(16-29-3)25(27)30-4/h7-9,11-14,16H,5-6,10,15H2,1-4H3
60 atoms
O  2.31464 -1.149908 -1.264267
O  -1.842047 0.58846 -2.369555
O  4.186053 -2.166426 -0.807648
O  -1.110768 -0.692665 1.247792
O  -4.683279 -1.222187 -1.679378
O  -1.394578 -2.685219 0.283632
C  5.284348 -0.070899 0.751785
C  3.933011 0.008002 0.101809
C  5.229005 -0.649374 2.166342
C  3.080952 1.057708 0.235865
C  1.797856 1.021612 -0.430228
C  6.600418 -0.69825 2.826452
C  1.458262 -0.10962 -1.17102
C  3.529337 -1.161958 -0.663661
C  3.39987 2.259985 1.062884
C  0.854676 2.051904 -0.38142
C  0.244576 -0.24115 -1.817688
C  -0.677313 0.795143 -1.736336
C  -0.361707 1.957043 -1.023782
C  6.556273 -1.245841 4.244436
C  -2.940107 1.444783 -2.117579
C  -3.395014 1.517635 -0.678913
C  -3.391077 0.433715 0.208017
C  -3.871549 2.7516 -0.237921
C  -3.853199 0.631378 1.51101
C  -2.938227 -0.926811 -0.167821
C  -4.341406 2.929271 1.052015
C  -4.326705 1.860383 1.936095
C  -1.758957 -1.540636 0.456083
C  -3.598468 -1.671607 -1.070536
C  0.041448 -1.182742 1.92824
C  -5.24634 -2.065487 -2.678516
H  5.948838 -0.682485 0.13887
H  5.742632 0.91914 0.782847
H  4.800067 -1.655714 2.13181
H  4.548534 -0.046955 2.777326
H  7.273863 -1.309796 2.218173
H  7.031341 0.307954 2.837056
H  2.671098 2.36775 1.86894
H  4.384359 2.214847 1.51804
H  3.350164 3.172162 0.465583
H  1.072518 2.955606 0.171238
H  0.010711 -1.14461 -2.367511
H  -1.049346 2.78781 -0.960537
H  5.922296 -0.632695 4.888356
H  7.550224 -1.271788 4.693792
H  6.159981 -2.262929 4.267341
H  -2.72367 2.455878 -2.478337
H  -3.741811 1.058001 -2.748625
H  -3.862276 3.594037 -0.920392
H  -3.853633 -0.204689 2.199821
H  -4.704351 3.898954 1.367579
H  -4.681394 1.981525 2.951413
H  -3.261329 -2.67301 -1.327859
H  0.459895 -0.332258 2.460245
H  -0.222955 -1.956988 2.650043
H  0.789127 -1.579453 1.241249
H  -5.530848 -3.034535 -2.264417
H  -6.13672 -1.563418 -3.048662
H  -4.55169 -2.214555 -3.506778
elementType: O C H
totalener: -1459.13499092 hartree
nucrepener: 3328.04823440 hartree
electener: -4787.18322532 hartree
oneelecener: -8607.75992257 hartree
twoeener: 3820.57669725 hartree
cpcmener: -0.04665248 hartree
kineticenergy: 1452.85154564 hartree
xcener: -140.272700915924 hartree
chargesum: 0.0000000
charge: -0.233303 -0.318087 -0.452199 -0.274259 -0.291683 -0.487968 -0.115306 -0.005457 -0.131022 -0.004844 -0.053767 -0.090781 0.149222 0.395405 -0.290209 -0.113360 -0.252250 0.310802 -0.208080 -0.276632 0.105370 -0.173493 0.093183 -0.124108 -0.229056 -0.127185 -0.171870 -0.149475 0.435915 0.234787 -0.149733 -0.130890 0.090047 0.094375 0.078888 0.070626 0.059936 0.057233 0.117540 0.098773 0.116546 0.153259 0.129708 0.138377 0.077101 0.089838 0.078794 0.118705 0.122573 0.138891 0.140623 0.156745 0.156828 0.107351 0.124563 0.136203 0.109102 0.122930 0.121947 0.122830
qa: -0.2333 -0.3181 -0.4522 -0.2743 -0.2917 -0.4880 -0.1153 -0.0055 -0.1310 -0.0048 -0.0538 -0.0908 0.1492 0.3954 -0.2902 -0.1134 -0.2522 0.3108 -0.2081 -0.2766 0.1054 -0.1735 0.0932 -0.1241 -0.2291 -0.1272 -0.1719 -0.1495 0.4359 0.2348 -0.1497 -0.1309 0.0900 0.0944 0.0789 0.0706 0.0599 0.0572 0.1175 0.0988 0.1165 0.1533 0.1297 0.1384 0.0771 0.0898 0.0788 0.1187 0.1226 0.1389 0.1406 0.1567 0.1568 0.1074 0.1246 0.1362 0.1091 0.1229 0.1219 0.1228
va: 2.1669 2.0760 2.0645 2.1004 2.1273 2.0208 3.8283 3.3720 3.8390 3.7031 3.6305 3.8692 3.9359 4.2931 3.9537 3.9129 3.9738 3.7943 3.9123 3.9474 3.7323 3.7147 3.3542 3.8656 3.9942 3.4635 3.9222 3.9017 4.1639 3.9770 3.8711 3.8574 1.0242 1.0009 1.0166 1.0092 1.0080 1.0076 0.9923 1.0072 0.9961 0.9952 1.0283 1.0142 1.0008 1.0042 1.0011 0.9978 0.9948 1.0017 1.0095 0.9910 0.9914 1.0282 0.9932 0.9973 0.9940 0.9866 0.9942 0.9855
dispcorr: -0.035426849 hartree
energy: -1459.170417769504
dipole: 21.98188 -24.24389 -2.26201 4.84679 -1.62672 3.22007 20.54975 -20.15677 0.39298
magnitude: 3.95475 au
magnitude: 10.05216 debye
