program: Gaussian 09
title: 000069388
version: EM64L-G09RevD.01
frameworkgroup: C1[X(C5H6O2)]
method: RPBEPBE
basis: SDD
operation: Freq
keyword: #p
keyword: freq=noraman
keyword: PBEPBE/SDD
title: #p freq=noraman PBEPBE/SDD
converged: NO NO NO NO
title: Mulliken charges:
elementType: O O C C C C C H H H H H H
charge: -0.253050 -0.247132 -0.343935 0.291230 -0.743580 0.193432 -0.445230 0.259426 0.259479 0.252288 0.252063 0.246780 0.278229
chargesum: 0.00000
title: Mulliken charges with hydrogens summed into heavy atoms:
elementType: O O C C C C C
charge: -0.253050 -0.247132 0.174970 0.291230 0.007551 0.193432 -0.167001
polarizability: 8.89342339e+01 8.50462315e+00 5.12647058e+01 5.38759139e-03 -9.44479245e-03 3.42544491e+01
1716.lowfreq: -52.7062 -13.4614 -5.8609 -0.0011 -0.0008 -0.0007 2.7699 23.5697 121.0670
frequency: -52.5677 23.2676 121.0666 168.3911 245.3152 308.6034 359.2689 493.1973 564.3285 596.3728 637.5022 679.8080 836.1141 896.8766 967.4705 988.0083 1000.6636 1042.6500 1190.7262 1197.3275 1337.9770 1382.8409 1452.7714 1453.1167 1455.0477 1654.7660 2158.5136 3004.6513 3010.3000 3061.2479 3098.1189 3146.7409 3428.2465
redmass: 1.0517 4.6979 3.9901 2.8932 5.9071 3.0952 3.8376 5.2831 3.0379 5.3301 1.2305 1.2606 7.0175 6.5434 1.6843 2.5365 2.6980 1.6602 1.0580 3.3001 1.3893 1.2520 1.0467 1.0617 1.0790 9.4392 6.0148 1.0564 1.0369 1.1052 1.0973 1.1010 1.1608
irintensity: 1.0000 0.7581 2.4147 11.4313 10.5160 7.8807 0.9865 4.6086 2.9349 6.5653 75.5236 56.8986 16.4261 43.6492 0.6654 156.6293 10.3507 10.6053 0.7221 343.3093 6.3987 50.8037 18.8164 33.0661 5.7525 212.5469 0.5941 9.7511 2.3882 9.0456 6.8904 9.5669 62.7021
temp: 298.150 k
press: 1.00000 atm
elementType: 8 8 6 6 6 6 6 1 1 1 1 1 1
symmnumber: 1
zpe: 250984.3 jmol-1
zpe.correction: 0.095595 hartree
zpe.thermalcorrener: 0.103058 hartree
zpe.thermalcorrenthalpy: 0.104002 hartree
zpe.thermalcorrgfe: 0.062761 hartree
zpe.sumelectzpe: -343.976517 hartree
zpe.sumelectthermal: -343.969053 hartree
zpe.sumelectthermalent: -343.968109 hartree
zpe.sumelectthermalfe: -344.009351 hartree
dipole: -0.6260 -1.3446 0.0083
dipole: 1.4832
quadrupole: -34.2375 -43.0722 -40.4255
quadrupole: -5.1709 -0.0295 0.0009
quadrupole: 5.0076 -3.8271 -1.1804 -5.1709 -0.0295 0.0009
hfenergy: -344.0721114 hartree
pointgroup: C01 [X(C5H6O2)]
dipole: -0.2638018 -0.5205018 0.0031069 debye
dipolederiv: -1.6934129 -0.089363 -0.000005 -0.0167725 -0.4771028 0.000336 -0.0025205 -0.0003985 -0.2857053 -0.7628015 -0.0139795 -0.0002344 -0.4160001 -0.9052723 -0.0011493 0.0013873 0.0012976 -0.3090692 0.9908257 -0.0125458 0.0006787 -0.3081665 0.3225786 -0.0005187 0.0004191 -0.0000063 0.3647027 1.8687357 0.0296489 -0.0000927 0.493623 1.1991126 0.0010693 -0.0005878 -0.0000323 0.2012854 -0.1955369 0.1431972 -0.0000609 0.2073223 -0.2934041 -0.0003887 0.0010018 -0.0011409 0.025907 -0.0165003 0.0755089 0.0007135 0.0061643 -0.1060569 0.0003766 0.0015375 0.0007857 -0.0665268 -0.444694 -0.0269633 -0.0010593 -0.0416273 -0.2660883 -0.0004833 -0.0025897 -0.0010038 -0.3067125 -0.0380141 -0.0308955 -0.0357595 0.0778146 0.0352198 -0.0624115 -0.0125862 -0.08415 -0.0076023 -0.037986 -0.0309691 0.0356389 0.0776803 0.0352447 0.0625371 0.01255 0.0839835 -0.0075637 0.0922238 -0.0040517 -0.0583332 -0.0048689 0.0728886 -0.0772781 -0.0213114 -0.100168 -0.0030619 0.093289 -0.0036197 0.0576444 -0.0041265 0.0727618 0.0774612 0.0205219 0.1003938 -0.0042285 -0.0906749 -0.023777 0.0005366 -0.0569887 0.0686149 0.000284 0.0009228 -0.0000369 0.1300358 0.2345464 -0.0121903 0.0003328 -0.0140541 0.2415034 0.0001654 0.0012551 0.0004761 0.2685393 unknown
polarizability: 89.4597964|7.2286988|50.7391281|0.0310925|-0.004719|34.2544643 unknown
InChI: InChI=1S/C5H6O2/c1-3-4-7-5(2)6/h1H,4H2,2H3
charge 0 multiplicity 1
13 atoms
O  0.220036 -0.430821 0.001721
O  1.863568 1.223504 0.000131
C  -0.799454 0.674096 0.000058
C  1.554925 0.011515 0.003338
C  2.496785 -1.171159 0.000013
C  -2.131892 0.073164 -0.002062
C  -3.276757 -0.380563 -0.002599
H  -0.635763 1.303935 0.893449
H  -0.633417 1.303544 -0.893161
H  2.313128 -1.80086 -0.887456
H  2.319551 -1.800164 0.889278
H  3.536864 -0.816329 -0.003835
H  -4.272076 -0.786463 0.002124
