program: Orca
programVersion: 5.0.4
elementType: O O O O O O C C C C C C C C C C C C C C C C C C C C C C C C C C H H H H H H H H H H H H H H H H H H H H H H H H H H H H
charge: 0
multiplicity: 1
keywords: wb97x-d3
keywords: def2-TZVPP
keywords: def2/J RIJCOSX
keywords: DEFGRID2
keywords: scfconv7
keywords: smallprint printgap noloewdin
keywords: NOSOSCF
formula: C26H28O6
InChI: InChI=1/C26H28O6/c1-5-6-10-21-17(2)20-13-12-19(14-24(20)32-26(21)28)31-15-18-9-7-8-11-22(18)23(16-29-3)25(27)30-4/h7-9,11-14,16H,5-6,10,15H2,1-4H3
60 atoms
O  2.006516 -1.5208 1.165437
O  -1.92573 0.887116 1.71324
O  3.734014 -2.831894 0.976925
O  -4.760006 -0.657279 1.006268
O  -1.012502 -0.948654 -1.724771
O  -3.35014 -2.354156 1.349397
C  5.190779 -1.176254 -0.769722
C  3.818759 -0.818177 -0.272585
C  6.301287 -0.8740 0.243913
C  3.14261 0.320608 -0.580128
C  1.839879 0.553683 0.0067
C  6.4673 0.605021 0.566872
C  1.310032 -0.399919 0.874775
C  3.226157 -1.78784 0.639711
C  3.667839 1.366346 -1.510024
C  1.059738 1.686678 -0.239112
C  0.060838 -0.271993 1.451851
C  -0.702214 0.852577 1.161046
C  -0.189069 1.847555 0.323018
C  7.559512 0.856676 1.595458
C  -2.862439 1.851216 1.269673
C  -3.231646 1.763679 -0.191981
C  -3.266523 0.568323 -0.922598
C  -3.586168 2.954948 -0.820878
C  -3.645393 0.615355 -2.265167
C  -2.889033 -0.74415 -0.348858
C  -3.974571 2.984411 -2.150097
C  -3.999662 1.805161 -2.879263
C  -3.652047 -1.345182 0.747133
C  -1.817309 -1.428046 -0.789915
C  -5.590228 -1.115142 2.068461
C  0.007101 -1.824382 -2.192173
H  5.216625 -2.23982 -1.014342
H  5.407367 -0.65636 -1.702994
H  7.241811 -1.260955 -0.159885
H  6.117305 -1.430776 1.167302
H  6.696345 1.155423 -0.351087
H  5.523598 1.013113 0.940216
H  2.98384 1.509446 -2.349021
H  3.752108 2.328236 -1.001221
H  4.643822 1.12584 -1.917351
H  1.430754 2.466111 -0.890235
H  -0.32944 -1.049119 2.09784
H  -0.747158 2.744782 0.097812
H  7.340867 0.348985 2.537251
H  7.664652 1.920443 1.814543
H  8.52946 0.496491 1.246646
H  -3.743439 1.686569 1.892152
H  -2.507449 2.861761 1.497383
H  -3.545678 3.88049 -0.257593
H  -3.675132 -0.306084 -2.833431
H  -4.244159 3.924097 -2.614829
H  -4.290913 1.809554 -3.921679
H  -1.569373 -2.402028 -0.374134
H  -5.060508 -1.119368 3.021675
H  -6.416983 -0.411543 2.124581
H  -5.984863 -2.112324 1.870635
H  0.670488 -1.234767 -2.819871
H  0.581581 -2.251721 -1.367699
H  -0.418274 -2.634028 -2.788705
elementType: O C H
totalener: -1459.13445344 hartree
nucrepener: 3345.29984238 hartree
electener: -4804.43429582 hartree
oneelecener: -8641.67514205 hartree
twoeener: 3837.24084623 hartree
cpcmener: -0.04515957 hartree
kineticenergy: 1452.84603153 hartree
xcener: -140.275179268930 hartree
chargesum: 0.0000000
charge: -0.233231 -0.319137 -0.452634 -0.287259 -0.288588 -0.494447 -0.139417 0.021749 -0.129940 -0.078074 -0.016832 -0.082798 0.143145 0.399430 -0.282808 -0.115133 -0.257230 0.340259 -0.212238 -0.284985 0.099839 -0.170417 0.077086 -0.132824 -0.211546 -0.124817 -0.168394 -0.155442 0.481604 0.186035 -0.143532 -0.142307 0.096868 0.099004 0.075700 0.068006 0.057895 0.062150 0.123209 0.116974 0.099834 0.153724 0.131071 0.136394 0.080113 0.090137 0.079212 0.124949 0.120359 0.137376 0.142643 0.157424 0.155859 0.126697 0.116489 0.124156 0.121481 0.124601 0.113730 0.138828
qa: -0.2332 -0.3191 -0.4526 -0.2873 -0.2886 -0.4944 -0.1394 0.0217 -0.1299 -0.0781 -0.0168 -0.0828 0.1431 0.3994 -0.2828 -0.1151 -0.2572 0.3403 -0.2122 -0.2850 0.0998 -0.1704 0.0771 -0.1328 -0.2115 -0.1248 -0.1684 -0.1554 0.4816 0.1860 -0.1435 -0.1423 0.0969 0.0990 0.0757 0.0680 0.0579 0.0621 0.1232 0.1170 0.0998 0.1537 0.1311 0.1364 0.0801 0.0901 0.0792 0.1249 0.1204 0.1374 0.1426 0.1574 0.1559 0.1267 0.1165 0.1242 0.1215 0.1246 0.1137 0.1388
va: 2.1644 2.0798 2.0643 2.1240 2.0956 2.0169 3.8616 3.2788 3.8549 3.6830 3.5884 3.8544 3.9393 4.2833 3.9403 3.9187 3.9828 3.7439 3.9330 3.9600 3.7576 3.7054 3.3705 3.8876 3.9705 3.4455 3.9140 3.9051 4.1411 3.9524 3.8765 3.8593 1.0194 1.0041 1.0108 1.0185 1.0044 1.0015 0.9966 0.9922 1.0108 0.9944 1.0296 1.0135 1.0006 1.0027 1.0007 0.9910 0.9976 1.0021 1.0085 0.9906 0.9919 1.0248 0.9928 0.9953 0.9939 0.9910 0.9855 0.9914
dispcorr: -0.036474159 hartree
energy: -1459.170927596476
dipole: 29.40121 -29.96762 -0.56640 9.56301 -6.35261 3.21040 -5.96632 3.81497 -2.15135
magnitude: 3.90587 au
magnitude: 9.92792 debye
