program: Orca
programVersion: 5.0.4
elementType: O O O O O O C C C C C C C C C C C C C C C C C C C C C C C C C C H H H H H H H H H H H H H H H H H H H H H H H H H H H H
charge: 0
multiplicity: 1
keywords: wb97x-d3
keywords: def2-TZVPP
keywords: def2/J RIJCOSX
keywords: DEFGRID2
keywords: scfconv7
keywords: smallprint printgap noloewdin
keywords: NOSOSCF
formula: C26H28O6
InChI: InChI=1/C26H28O6/c1-5-6-10-21-17(2)20-13-12-19(14-24(20)32-26(21)28)31-15-18-9-7-8-11-22(18)23(16-29-3)25(27)30-4/h7-9,11-14,16H,5-6,10,15H2,1-4H3
60 atoms
O  1.98289 -1.521981 1.183843
O  -1.945087 0.897835 1.683111
O  3.705349 -2.84229 1.016972
O  -4.745358 -0.674763 1.026179
O  -1.043766 -0.902506 -1.776171
O  -3.319846 -2.36921 1.310713
C  5.194298 -1.194195 -0.707819
C  3.82003 -0.825021 -0.224772
C  6.302461 -0.886852 0.306255
C  3.152982 0.316417 -0.542565
C  1.838656 0.550882 0.018129
C  6.502044 0.597948 0.579492
C  1.294533 -0.399314 0.881322
C  3.209167 -1.793612 0.676766
C  3.702828 1.364711 -1.455182
C  1.059015 1.679373 -0.249944
C  0.038521 -0.266799 1.441527
C  -0.719739 0.857125 1.136009
C  -0.198881 1.842966 0.292159
C  7.638595 0.862872 1.555438
C  -2.87673 1.866865 1.24177
C  -3.267077 1.771275 -0.213721
C  -3.309425 0.573692 -0.940154
C  -3.639167 2.959075 -0.839405
C  -3.716777 0.614967 -2.274643
C  -2.905867 -0.73522 -0.375417
C  -4.054564 2.982757 -2.160501
C  -4.089742 1.800926 -2.885036
C  -3.642483 -1.35505 0.727784
C  -1.826556 -1.397501 -0.830984
C  -5.541758 -1.151595 2.106388
C  0.002231 -1.749323 -2.239033
H  5.214697 -2.260659 -0.939983
H  5.418704 -0.68652 -1.646178
H  7.236514 -1.3098 -0.075853
H  6.097574 -1.407665 1.246193
H  6.705031 1.117666 -0.362147
H  5.578841 1.03148 0.975018
H  3.029419 1.535192 -2.297289
H  3.801303 2.316246 -0.929396
H  4.677522 1.111593 -1.858099
H  1.437844 2.453375 -0.903126
H  -0.360072 -1.039244 2.088092
H  -0.756508 2.735671 0.048007
H  7.459425 0.376722 2.516719
H  7.760155 1.930274 1.746572
H  8.589691 0.488758 1.171047
H  -3.752209 1.715703 1.875435
H  -2.509729 2.875865 1.457219
H  -3.59222 3.886501 -0.279695
H  -3.753585 -0.308318 -2.839545
H  -4.337213 3.919882 -2.622667
H  -4.403292 1.800447 -3.920984
H  -1.556167 -2.368091 -0.42147
H  -5.924465 -2.154416 1.913598
H  -4.988153 -1.151714 3.046059
H  -6.378489 -0.462457 2.187249
H  -0.398793 -2.583463 -2.818126
H  0.639357 -1.146005 -2.880804
H  0.597878 -2.142517 -1.413013
elementType: O C H
totalener: -1459.13472689 hartree
nucrepener: 3341.02762024 hartree
electener: -4800.16234713 hartree
oneelecener: -8633.10891993 hartree
twoeener: 3832.94657279 hartree
cpcmener: -0.04514399 hartree
kineticenergy: 1452.84179395 hartree
xcener: -140.274286664967 hartree
chargesum: -0.0000000
charge: -0.233373 -0.318484 -0.452547 -0.287057 -0.288251 -0.495405 -0.137170 0.018445 -0.129879 -0.064957 -0.029198 -0.080912 0.145178 0.400366 -0.284077 -0.120226 -0.254291 0.339518 -0.208793 -0.284787 0.097845 -0.170240 0.076449 -0.132417 -0.211541 -0.125017 -0.168854 -0.155346 0.483545 0.185221 -0.143474 -0.139883 0.096968 0.098745 0.074305 0.069297 0.056358 0.061022 0.121412 0.118779 0.099041 0.154007 0.130520 0.137060 0.079927 0.090058 0.079274 0.125035 0.120926 0.137390 0.142931 0.157331 0.155957 0.126787 0.120955 0.116885 0.124197 0.138496 0.124112 0.111836
qa: -0.2334 -0.3185 -0.4525 -0.2871 -0.2883 -0.4954 -0.1372 0.0184 -0.1299 -0.0650 -0.0292 -0.0809 0.1452 0.4004 -0.2841 -0.1202 -0.2543 0.3395 -0.2088 -0.2848 0.0978 -0.1702 0.0764 -0.1324 -0.2115 -0.1250 -0.1689 -0.1553 0.4835 0.1852 -0.1435 -0.1399 0.0970 0.0987 0.0743 0.0693 0.0564 0.0610 0.1214 0.1188 0.0990 0.1540 0.1305 0.1371 0.0799 0.0901 0.0793 0.1250 0.1209 0.1374 0.1429 0.1573 0.1560 0.1268 0.1210 0.1169 0.1242 0.1385 0.1241 0.1118
va: 2.1651 2.0806 2.0640 2.1245 2.0965 2.0156 3.8562 3.2846 3.8566 3.6852 3.5981 3.8566 3.9350 4.2827 3.9414 3.9215 3.9826 3.7425 3.9316 3.9601 3.7600 3.7050 3.3734 3.8892 3.9695 3.4444 3.9146 3.9045 4.1401 3.9527 3.8764 3.8606 1.0197 1.0041 1.0104 1.0182 1.0044 1.0012 0.9971 0.9917 1.0111 0.9943 1.0302 1.0129 1.0006 1.0027 1.0008 0.9907 0.9974 1.0020 1.0084 0.9907 0.9919 1.0245 0.9941 0.9925 0.9953 0.9912 0.9914 0.9849
dispcorr: -0.036380388 hartree
energy: -1459.171107280337
dipole: 29.89186 -30.40398 -0.51212 9.62002 -6.37553 3.24448 -5.82784 3.69735 -2.13049
magnitude: 3.91509 au
magnitude: 9.95137 debye
