program: Orca
programVersion: 5.0.4
elementType: O O O O O O C C C C C C C C C C C C C C C C C C C C C C C C C C H H H H H H H H H H H H H H H H H H H H H H H H H H H H
charge: 0
multiplicity: 1
keywords: wb97x-d3
keywords: def2-TZVPP
keywords: def2/J RIJCOSX
keywords: DEFGRID2
keywords: scfconv7
keywords: smallprint printgap noloewdin
keywords: NOSOSCF
formula: C26H28O6
InChI: InChI=1/C26H28O6/c1-5-6-10-21-17(2)20-13-12-19(14-24(20)32-26(21)28)31-15-18-9-7-8-11-22(18)23(16-29-3)25(27)30-4/h7-9,11-14,16H,5-6,10,15H2,1-4H3
60 atoms
O  1.639598 1.773684 0.758562
O  -1.930563 1.12957 -2.283839
O  3.119017 1.999328 2.339336
O  -0.664522 -1.301413 0.811037
O  -4.301918 -0.881708 -2.047562
O  -0.884523 -2.798968 -0.828267
C  5.116305 0.389586 1.080123
C  3.756864 0.652444 0.490966
C  5.245487 -0.98226 1.749514
C  3.331457 0.128358 -0.689748
C  1.989705 0.401961 -1.151316
C  4.293311 -1.21433 2.914968
C  1.180868 1.239182 -0.392529
C  2.864276 1.495727 1.269395
C  4.191968 -0.746373 -1.542045
C  1.420366 -0.152947 -2.307305
C  -0.124252 1.556057 -0.741866
C  -0.664994 0.964898 -1.872812
C  0.120568 0.111093 -2.661122
C  4.502122 -2.573942 3.565144
C  -2.84278 1.859443 -1.492555
C  -3.136356 1.332066 -0.10484
C  -3.018201 0.002182 0.317224
C  -3.601711 2.289055 0.798451
C  -3.371862 -0.315406 1.632342
C  -2.533344 -1.097871 -0.54905
C  -3.957785 1.957463 2.092629
C  -3.840133 0.640602 2.514795
C  -1.301734 -1.831177 -0.226148
C  -3.182062 -1.471142 -1.665062
C  0.561322 -1.898735 1.221068
C  -4.810842 -1.261418 -3.321912
H  5.87598 0.473328 0.300085
H  5.356122 1.166598 1.806567
H  6.276408 -1.091041 2.100999
H  5.096493 -1.769224 1.003032
H  4.425154 -0.426395 3.662012
H  3.2576 -1.138768 2.569527
H  3.788052 -1.760403 -1.581144
H  4.22249 -0.37667 -2.568233
H  5.215022 -0.813382 -1.184941
H  2.002085 -0.818934 -2.929867
H  -0.687733 2.220661 -0.101186
H  -0.311234 -0.346512 -3.541908
H  5.512594 -2.673366 3.967206
H  4.354308 -3.384696 2.848394
H  3.805142 -2.734941 4.388963
H  -2.512498 2.900992 -1.409782
H  -3.763884 1.87304 -2.078189
H  -3.677845 3.321517 0.475819
H  -3.285866 -1.343297 1.962679
H  -4.313404 2.72369 2.769317
H  -4.107663 0.360767 3.525492
H  -2.803727 -2.274986 -2.292408
H  0.402155 -2.903673 1.615625
H  1.287802 -1.944493 0.409938
H  0.947866 -1.265618 2.015821
H  -4.952499 -2.342016 -3.386551
H  -5.773743 -0.770415 -3.437615
H  -4.144836 -0.934252 -4.122256
elementType: O C H
totalener: -1459.13215896 hartree
nucrepener: 3418.52251513 hartree
electener: -4877.65467409 hartree
oneelecener: -8788.67922046 hartree
twoeener: 3911.02454637 hartree
cpcmener: -0.04472604 hartree
kineticenergy: 1452.85074057 hartree
xcener: -140.276722265133 hartree
chargesum: 0.0000000
charge: -0.233356 -0.320598 -0.453191 -0.273038 -0.288875 -0.491366 -0.131241 -0.047022 -0.142173 0.034029 -0.146514 -0.064455 0.200972 0.403809 -0.296336 -0.073910 -0.205758 0.379792 -0.301612 -0.284976 0.094665 -0.167743 0.089310 -0.124458 -0.227278 -0.144813 -0.177727 -0.147069 0.460141 0.237286 -0.162396 -0.128521 0.099685 0.093438 0.075689 0.070668 0.064429 0.036753 0.121100 0.116461 0.099442 0.150459 0.127481 0.133486 0.081521 0.077767 0.090829 0.124223 0.126445 0.135407 0.137239 0.156836 0.155992 0.107604 0.138448 0.112422 0.135197 0.120570 0.122570 0.122261
qa: -0.2334 -0.3206 -0.4532 -0.2730 -0.2889 -0.4914 -0.1312 -0.0470 -0.1422 0.0340 -0.1465 -0.0645 0.2010 0.4038 -0.2963 -0.0739 -0.2058 0.3798 -0.3016 -0.2850 0.0947 -0.1677 0.0893 -0.1245 -0.2273 -0.1448 -0.1777 -0.1471 0.4601 0.2373 -0.1624 -0.1285 0.0997 0.0934 0.0757 0.0707 0.0644 0.0368 0.1211 0.1165 0.0994 0.1505 0.1275 0.1335 0.0815 0.0778 0.0908 0.1242 0.1264 0.1354 0.1372 0.1568 0.1560 0.1076 0.1384 0.1124 0.1352 0.1206 0.1226 0.1223
va: 2.1818 2.0755 2.0598 2.1036 2.1303 2.0175 3.8585 3.3574 3.8789 3.6057 3.6543 3.8453 3.9559 4.2744 3.9474 3.8391 3.9420 3.6526 4.0306 3.9532 3.7426 3.6831 3.3669 3.8874 3.9872 3.4440 3.9234 3.8978 4.1401 3.9753 3.8686 3.8562 1.0013 1.0266 1.0124 1.0029 1.0151 1.0162 0.9907 0.9971 1.0079 0.9936 1.0321 1.0150 1.0017 1.0009 1.0031 0.9983 0.9915 1.0017 1.0120 0.9912 0.9918 1.0278 0.9973 0.9877 0.9914 0.9875 0.9942 0.9864
dispcorr: -0.038119221 hartree
energy: -1459.170278179373
dipole: 20.14205 -21.26857 -1.12651 -15.09434 14.31964 -0.77469 6.47118 -9.03506 -2.56388
magnitude: 2.90563 au
magnitude: 7.38551 debye
