program: Orca
programVersion: 5.0.4
elementType: O O O O O O C C C C C C C C C C C C C C C C C C C C C C C C C C H H H H H H H H H H H H H H H H H H H H H H H H H H H H
charge: 0
multiplicity: 1
keywords: wb97x-d3
keywords: def2-TZVPP
keywords: def2/J RIJCOSX
keywords: DEFGRID2
keywords: scfconv7
keywords: smallprint printgap noloewdin
keywords: NOSOSCF
formula: C26H28O6
InChI: InChI=1/C26H28O6/c1-5-6-10-21-17(2)20-13-12-19(14-24(20)32-26(21)28)31-15-18-9-7-8-11-22(18)23(16-29-3)25(27)30-4/h7-9,11-14,16H,5-6,10,15H2,1-4H3
60 atoms
O  1.644675 -0.521439 -0.702654
O  -1.809373 2.68422 -0.257032
O  3.121128 -2.110695 -0.882843
O  -5.346572 -0.166012 -0.870033
O  -1.332524 -2.392394 -0.161089
O  -4.676588 -1.628313 -2.418887
C  5.386074 -0.426448 -0.644456
C  3.974953 0.086264 -0.612636
C  5.894069 -0.809388 0.746683
C  3.633416 1.385591 -0.401639
C  2.236424 1.756872 -0.359147
C  7.312553 -1.361361 0.725065
C  1.277225 0.763962 -0.518729
C  2.937202 -0.923197 -0.741844
C  4.643519 2.467195 -0.198623
C  1.764643 3.063797 -0.16155
C  -0.086559 1.014665 -0.493823
C  -0.519254 2.316021 -0.294889
C  0.420009 3.344286 -0.127004
C  7.817615 -1.731633 2.110846
C  -2.821309 1.693498 -0.372283
C  -2.952195 0.849613 0.871173
C  -3.214134 -0.523804 0.80429
C  -2.836457 1.461328 2.117248
C  -3.343049 -1.247661 1.989747
C  -3.337452 -1.248438 -0.483527
C  -2.963557 0.730124 3.28698
C  -3.218393 -0.632357 3.223957
C  -4.49346 -1.056911 -1.364975
C  -2.414045 -2.146839 -0.877212
C  -6.508003 0.132689 -1.640722
C  -0.415441 -3.347646 -0.690792
H  5.443985 -1.295998 -1.301798
H  6.0504 0.319526 -1.083535
H  5.220034 -1.550078 1.188371
H  5.85227 0.068854 1.399605
H  7.350298 -2.240438 0.074375
H  7.983656 -0.622136 0.276389
H  4.490191 2.955712 0.765401
H  5.666528 2.105097 -0.22239
H  4.545285 3.238767 -0.964772
H  2.46626 3.876454 -0.03126
H  -0.765506 0.186499 -0.630968
H  0.077429 4.35923 0.028275
H  7.828129 -0.865344 2.775785
H  8.833714 -2.12764 2.074707
H  7.185826 -2.492316 2.574033
H  -3.738384 2.259964 -0.540512
H  -2.654842 1.082042 -1.263599
H  -2.641036 2.524847 2.179585
H  -3.550815 -2.309407 1.93873
H  -2.867215 1.224937 4.244875
H  -3.322394 -1.213516 4.131131
H  -2.527261 -2.691586 -1.812087
H  -7.061211 0.874254 -1.070339
H  -6.249368 0.551884 -2.613737
H  -7.134757 -0.748144 -1.783312
H  -0.074234 -3.062634 -1.68713
H  0.435994 -3.376642 -0.016144
H  -0.86961 -4.339596 -0.733229
elementType: O C H
totalener: -1459.13981069 hartree
nucrepener: 3223.88044132 hartree
electener: -4683.02025202 hartree
oneelecener: -8399.07176481 hartree
twoeener: 3716.05151280 hartree
cpcmener: -0.03970739 hartree
kineticenergy: 1452.83256486 hartree
xcener: -140.265812310275 hartree
chargesum: 0.0000000
charge: -0.242152 -0.322488 -0.474987 -0.283962 -0.286009 -0.491556 -0.120315 0.033151 -0.128955 -0.006623 -0.041428 -0.091865 0.083566 0.372303 -0.295449 -0.097156 -0.112818 0.296379 -0.264456 -0.276644 0.091314 -0.133188 0.056145 -0.151351 -0.205492 -0.176777 -0.163124 -0.157230 0.497853 0.251215 -0.138605 -0.145744 0.089282 0.095149 0.077930 0.071805 0.059653 0.057996 0.116338 0.098452 0.117793 0.153783 0.114187 0.137773 0.077735 0.089594 0.078887 0.123649 0.127144 0.138320 0.141946 0.157088 0.156303 0.109984 0.123408 0.116249 0.119722 0.120198 0.121019 0.135059
qa: -0.2422 -0.3225 -0.4750 -0.2840 -0.2860 -0.4916 -0.1203 0.0332 -0.1290 -0.0066 -0.0414 -0.0919 0.0836 0.3723 -0.2954 -0.0972 -0.1128 0.2964 -0.2645 -0.2766 0.0913 -0.1332 0.0561 -0.1514 -0.2055 -0.1768 -0.1631 -0.1572 0.4979 0.2512 -0.1386 -0.1457 0.0893 0.0951 0.0779 0.0718 0.0597 0.0580 0.1163 0.0985 0.1178 0.1538 0.1142 0.1378 0.0777 0.0896 0.0789 0.1236 0.1271 0.1383 0.1419 0.1571 0.1563 0.1100 0.1234 0.1162 0.1197 0.1202 0.1210 0.1351
va: 2.2103 2.0891 2.0377 2.1189 2.1181 2.0269 3.8278 3.4814 3.8373 3.7326 3.7506 3.8696 4.1757 4.2388 3.9463 3.8913 3.8089 3.8082 4.0611 3.9464 3.7949 3.6494 3.4802 3.9026 3.9775 3.4543 3.9131 3.9058 4.1218 3.9311 3.8755 3.8494 1.0250 1.0017 1.0164 1.0088 1.0085 1.0077 0.9917 1.0072 0.9947 0.9936 1.0279 1.0147 1.0009 1.0043 1.0010 0.9917 0.9963 1.0143 1.0068 0.9910 0.9915 1.0301 0.9958 0.9931 0.9937 0.9895 1.0003 0.9884
dispcorr: -0.031867402 hartree
energy: -1459.171678095924
dipole: 33.62127 -33.12033 0.50094 -3.03730 4.96736 1.93006 7.68898 -7.01607 0.67291
magnitude: 2.10449 au
magnitude: 5.34918 debye
