program: Orca
programVersion: 5.0.4
elementType: O O O O O O C C C C C C C C C C C C C C C C C C C C C C C C C C H H H H H H H H H H H H H H H H H H H H H H H H H H H H
charge: 0
multiplicity: 1
keywords: wb97x-d3
keywords: def2-TZVPP
keywords: def2/J RIJCOSX
keywords: DEFGRID2
keywords: scfconv7
keywords: smallprint printgap noloewdin
keywords: NOSOSCF
formula: C26H28O6
InChI: InChI=1/C26H28O6/c1-5-6-10-21-17(2)20-13-12-19(14-24(20)32-26(21)28)31-15-18-9-7-8-11-22(18)23(16-29-3)25(27)30-4/h7-9,11-14,16H,5-6,10,15H2,1-4H3
60 atoms
O  1.804052 -1.20826 1.486271
O  -2.15207 1.215996 1.57267
O  3.566119 -2.486171 1.570754
O  -3.447935 -2.053101 1.417854
O  -1.078383 -0.943386 -1.623344
O  -4.940712 -0.45117 0.986538
C  5.044714 -1.081271 -0.389603
C  3.664127 -0.67911 0.041512
C  6.134925 -0.424884 0.458447
C  3.01638 0.429873 -0.401384
C  1.694003 0.729194 0.102333
C  7.537834 -0.819274 0.019668
C  1.121279 -0.131532 1.038099
C  3.051679 -1.519342 1.059006
C  3.60927 1.372337 -1.397017
C  0.929015 1.827774 -0.296917
C  -0.155738 0.048872 1.533246
C  -0.90292 1.133147 1.089226
C  -0.347263 2.039418 0.181109
C  8.62059 -0.16693 0.864283
C  -3.066933 2.130499 0.997029
C  -3.364449 1.907348 -0.466568
C  -3.355294 0.65111 -1.087049
C  -3.690775 3.03351 -1.217824
C  -3.662271 0.572458 -2.446153
C  -3.017397 -0.599222 -0.368981
C  -4.005722 2.938943 -2.56322
C  -3.985849 1.69881 -3.18356
C  -3.896802 -1.009128 0.725455
C  -1.930435 -1.328035 -0.684803
C  -4.259514 -2.527326 2.487877
C  -0.023875 -1.849031 -1.927521
H  5.145355 -2.166142 -0.328198
H  5.198253 -0.829543 -1.440116
H  5.989677 -0.695084 1.508964
H  6.027671 0.663392 0.404781
H  7.641425 -1.907369 0.067451
H  7.678517 -0.54616 -1.030861
H  3.701155 2.371812 -0.967703
H  4.595476 1.070205 -1.735216
H  2.968473 1.461886 -2.276115
H  1.333798 2.536147 -1.006529
H  -0.578442 -0.658193 2.236472
H  -0.893874 2.904258 -0.164265
H  8.55794 0.922144 0.819269
H  9.618311 -0.450935 0.5267
H  8.534771 -0.457138 1.913353
H  -3.977439 2.017502 1.586959
H  -2.723096 3.159168 1.14796
H  -3.686105 4.006281 -0.739141
H  -3.661925 -0.397283 -2.928215
H  -4.25578 3.829788 -3.124192
H  -4.22265 1.606842 -4.235647
H  -1.704579 -2.260294 -0.175001
H  -4.384764 -1.770798 3.263425
H  -5.240391 -2.852721 2.139848
H  -3.731729 -3.380229 2.906932
H  0.512563 -2.161014 -1.029483
H  -0.404881 -2.733569 -2.441282
H  0.663133 -1.327187 -2.588722
elementType: O C H
totalener: -1459.13562430 hartree
nucrepener: 3318.70226240 hartree
electener: -4777.83788670 hartree
oneelecener: -8588.42241782 hartree
twoeener: 3810.58453112 hartree
cpcmener: -0.04485735 hartree
kineticenergy: 1452.87184255 hartree
xcener: -140.278480141206 hartree
chargesum: -0.0000000
charge: -0.235922 -0.318256 -0.452845 -0.295676 -0.286187 -0.482110 -0.112633 -0.024604 -0.131659 -0.002766 -0.048070 -0.090281 0.147784 0.401238 -0.289663 -0.123880 -0.261524 0.350227 -0.210103 -0.276074 0.087319 -0.166610 0.093134 -0.131619 -0.203108 -0.097325 -0.169908 -0.155176 0.454564 0.153190 -0.132060 -0.143756 0.089938 0.095127 0.078252 0.072055 0.059607 0.057840 0.118725 0.098784 0.115950 0.152898 0.127717 0.138510 0.077015 0.089600 0.078892 0.126690 0.119836 0.137081 0.141402 0.157155 0.155818 0.135042 0.113805 0.116861 0.122599 0.112191 0.139264 0.125705
qa: -0.2359 -0.3183 -0.4528 -0.2957 -0.2862 -0.4821 -0.1126 -0.0246 -0.1317 -0.0028 -0.0481 -0.0903 0.1478 0.4012 -0.2897 -0.1239 -0.2615 0.3502 -0.2101 -0.2761 0.0873 -0.1666 0.0931 -0.1316 -0.2031 -0.0973 -0.1699 -0.1552 0.4546 0.1532 -0.1321 -0.1438 0.0899 0.0951 0.0783 0.0721 0.0596 0.0578 0.1187 0.0988 0.1160 0.1529 0.1277 0.1385 0.0770 0.0896 0.0789 0.1267 0.1198 0.1371 0.1414 0.1572 0.1558 0.1350 0.1138 0.1169 0.1226 0.1122 0.1393 0.1257
va: 2.1658 2.0778 2.0637 2.0847 2.0888 2.0391 3.8320 3.3887 3.8387 3.6931 3.6190 3.8683 3.9312 4.2886 3.9562 3.9308 3.9936 3.7243 3.9321 3.9467 3.7451 3.7051 3.3988 3.8881 3.9641 3.4499 3.9159 3.9060 4.1669 3.9592 3.8768 3.8596 1.0251 1.0012 1.0167 1.0087 1.0084 1.0077 0.9921 1.0072 0.9963 0.9955 1.0317 1.0128 1.0009 1.0045 1.0011 0.9979 0.9982 1.0016 1.0087 0.9907 0.9918 1.0188 0.9930 0.9941 0.9955 0.9854 0.9910 0.9910
dispcorr: -0.035328315 hartree
energy: -1459.170952615126
dipole: 36.44593 -35.61278 0.83315 1.27679 0.12446 1.40125 -7.66172 5.56205 -2.09968
magnitude: 2.65825 au
magnitude: 6.75674 debye
