program: Orca
programVersion: 5.0.4
elementType: O O O O O O C C C C C C C C C C C C C C C C C C C C C C C C C C H H H H H H H H H H H H H H H H H H H H H H H H H H H H
charge: 0
multiplicity: 1
keywords: wb97x-d3
keywords: def2-TZVPP
keywords: def2/J RIJCOSX
keywords: DEFGRID2
keywords: scfconv7
keywords: smallprint printgap noloewdin
keywords: NOSOSCF
formula: C26H28O6
InChI: InChI=1/C26H28O6/c1-5-6-10-21-17(2)20-13-12-19(14-24(20)32-26(21)28)31-15-18-9-7-8-11-22(18)23(16-29-3)25(27)30-4/h7-9,11-14,16H,5-6,10,15H2,1-4H3
60 atoms
O  1.791302 -1.241236 1.448626
O  -2.152384 1.20612 1.582712
O  3.558786 -2.512215 1.525978
O  -3.420826 -2.019355 1.456772
O  -1.073308 -0.985391 -1.624769
O  -4.934538 -0.449354 0.980868
C  5.031503 -1.091081 -0.425435
C  3.649062 -0.6971 0.00622
C  6.106344 -0.440689 0.446676
C  3.002062 0.417782 -0.422467
C  1.686543 0.719175 0.097063
C  7.520767 -0.815321 0.028677
C  1.112519 -0.153754 1.020562
C  3.040909 -1.543969 1.020764
C  3.584737 1.364026 -1.420645
C  0.930661 1.833741 -0.275129
C  -0.162097 0.025493 1.522791
C  -0.902403 1.123339 1.100858
C  -0.341291 2.04608 0.212631
C  8.576726 -0.134622 0.885667
C  -3.063189 2.120504 0.998982
C  -3.336593 1.901236 -0.470018
C  -3.328334 0.644262 -1.089779
C  -3.637568 3.030522 -1.227854
C  -3.615277 0.56795 -2.45337
C  -3.004933 -0.606566 -0.36626
C  -3.930597 2.938443 -2.578525
C  -3.915445 1.697301 -3.19673
C  -3.882278 -0.999662 0.736383
C  -1.928381 -1.35146 -0.681378
C  -4.228673 -2.4757 2.537568
C  -0.043366 -1.917111 -1.936172
H  5.135703 -2.176729 -0.382727
H  5.193372 -0.819164 -1.469657
H  5.946766 -0.725798 1.491264
H  5.990665 0.64753 0.406309
H  7.643003 -1.901169 0.086846
H  7.672461 -0.547421 -1.021635
H  2.93274 1.455092 -2.291447
H  3.681099 2.362826 -0.9908
H  4.566602 1.063027 -1.772156
H  1.339847 2.555107 -0.969054
H  -0.58765 -0.692627 2.213279
H  -0.880163 2.925416 -0.108669
H  8.470199 -0.407106 1.937722
H  8.50004 0.952771 0.819975
H  9.585965 -0.410619 0.57662
H  -3.981641 2.001518 1.575243
H  -2.726123 3.149784 1.159945
H  -3.628832 4.003836 -0.750336
H  -3.617417 -0.401954 -2.934887
H  -4.158793 3.83205 -3.145129
H  -4.135791 1.606957 -4.252508
H  -1.713665 -2.283547 -0.166008
H  -5.205458 -2.820722 2.197194
H  -3.691736 -3.311286 2.979174
H  -4.362939 -1.701065 3.293283
H  0.653021 -1.41221 -2.60092
H  0.489958 -2.243835 -1.041317
H  -0.449829 -2.791503 -2.448618
elementType: O C H
totalener: -1459.13545221 hartree
nucrepener: 3323.00443777 hartree
electener: -4782.13988998 hartree
oneelecener: -8597.05594932 hartree
twoeener: 3814.91605934 hartree
cpcmener: -0.04484079 hartree
kineticenergy: 1452.86365650 hartree
xcener: -140.276964600932 hartree
chargesum: 0.0000000
charge: -0.235790 -0.318805 -0.452688 -0.295247 -0.286931 -0.481754 -0.111731 -0.022945 -0.132954 -0.007408 -0.039652 -0.090404 0.141440 0.400868 -0.289591 -0.123352 -0.258103 0.346118 -0.210257 -0.275750 0.088662 -0.164853 0.088603 -0.133647 -0.201825 -0.094145 -0.169202 -0.154968 0.453598 0.152524 -0.132548 -0.144000 0.089838 0.094677 0.078889 0.071792 0.060107 0.057367 0.117138 0.117582 0.099764 0.153156 0.128483 0.137830 0.078752 0.077196 0.089653 0.126796 0.119434 0.137211 0.141272 0.157112 0.155828 0.135269 0.117254 0.122698 0.114013 0.126295 0.112648 0.138683
qa: -0.2358 -0.3188 -0.4527 -0.2952 -0.2869 -0.4818 -0.1117 -0.0229 -0.1330 -0.0074 -0.0397 -0.0904 0.1414 0.4009 -0.2896 -0.1234 -0.2581 0.3461 -0.2103 -0.2757 0.0887 -0.1649 0.0886 -0.1336 -0.2018 -0.0941 -0.1692 -0.1550 0.4536 0.1525 -0.1325 -0.1440 0.0898 0.0947 0.0789 0.0718 0.0601 0.0574 0.1171 0.1176 0.0998 0.1532 0.1285 0.1378 0.0788 0.0772 0.0897 0.1268 0.1194 0.1372 0.1413 0.1571 0.1558 0.1353 0.1173 0.1227 0.1140 0.1263 0.1126 0.1387
va: 2.1653 2.0762 2.0639 2.0843 2.0877 2.0398 3.8347 3.3906 3.8383 3.6929 3.6195 3.8694 3.9389 4.2881 3.9555 3.9311 3.9860 3.7331 3.9335 3.9455 3.7410 3.7055 3.4092 3.8885 3.9611 3.4472 3.9160 3.9056 4.1664 3.9602 3.8763 3.8578 1.0252 1.0019 1.0168 1.0081 1.0085 1.0080 0.9960 0.9922 1.0071 0.9955 1.0319 1.0133 1.0011 1.0009 1.0046 0.9983 0.9981 1.0018 1.0088 0.9906 0.9919 1.0189 0.9944 0.9955 0.9930 0.9910 0.9858 0.9911
dispcorr: -0.035377840 hartree
energy: -1459.170830046880
dipole: 36.27613 -35.44553 0.83060 1.43478 -0.02629 1.40848 -7.48400 5.42412 -2.05988
magnitude: 2.62999 au
magnitude: 6.68489 debye
