program: Orca
programVersion: 5.0.4
elementType: O O O O O O C C C C C C C C C C C C C C C C C C C C C C C C C C H H H H H H H H H H H H H H H H H H H H H H H H H H H H
charge: 0
multiplicity: 1
keywords: wb97x-d3
keywords: def2-TZVPP
keywords: def2/J RIJCOSX
keywords: DEFGRID2
keywords: scfconv7
keywords: smallprint printgap noloewdin
keywords: NOSOSCF
formula: C26H28O6
InChI: InChI=1/C26H28O6/c1-5-6-10-21-17(2)20-13-12-19(14-24(20)32-26(21)28)31-15-18-9-7-8-11-22(18)23(16-29-3)25(27)30-4/h7-9,11-14,16H,5-6,10,15H2,1-4H3
60 atoms
O  2.033225 1.318867 -1.203936
O  -2.100843 1.709294 1.071924
O  3.839471 1.098209 -2.397071
O  -4.715638 -0.10182 1.169143
O  -0.607159 -1.918329 0.002378
O  -3.451383 -0.937821 2.809349
C  5.518329 0.329887 -0.219858
C  4.051529 0.631636 -0.077891
C  5.894849 -1.15613 -0.255721
C  3.369981 0.54743 1.095596
C  1.953891 0.837336 1.122959
C  5.325939 -1.976849 -1.413869
C  1.329992 1.226277 -0.056426
C  3.351337 1.016799 -1.293401
C  4.021802 0.146265 2.378667
C  1.145388 0.747495 2.266603
C  -0.019864 1.540816 -0.135093
C  -0.787238 1.444616 1.014698
C  -0.196604 1.036508 2.219933
C  3.896899 -2.468043 -1.219234
C  -2.808658 2.023276 -0.111034
C  -2.906417 0.911391 -1.128236
C  -2.875096 -0.453623 -0.81473
C  -3.077799 1.300675 -2.454701
C  -3.013351 -1.380854 -1.849137
C  -2.659614 -0.96239 0.559868
C  -3.223872 0.369607 -3.469204
C  -3.189663 -0.982671 -3.163747
C  -3.612351 -0.679525 1.634853
C  -1.558102 -1.663319 0.886265
C  -5.70626 0.290597 2.113048
C  0.503446 -2.683995 0.454796
H  5.897479 0.806753 -1.124154
H  6.061229 0.797982 0.604382
H  5.61991 -1.631416 0.691432
H  6.986551 -1.196998 -0.302811
H  5.403515 -1.409245 -2.345641
H  5.964872 -2.85367 -1.550037
H  3.638133 -0.818668 2.717775
H  5.10082 0.058699 2.295954
H  3.808019 0.86894 3.167607
H  1.576683 0.438923 3.209114
H  -0.427917 1.844931 -1.089314
H  -0.80803 0.950882 3.10908
H  3.165907 -1.661559 -1.181276
H  3.802414 -3.034692 -0.289915
H  3.599158 -3.128794 -2.03542
H  -3.806681 2.3035 0.230556
H  -2.381409 2.914453 -0.583535
H  -3.087439 2.357491 -2.696905
H  -2.993871 -2.437179 -1.611205
H  -3.354723 0.699707 -4.491648
H  -3.296258 -1.724908 -3.944246
H  -1.412996 -2.037216 1.897134
H  -6.113724 -0.565265 2.652323
H  -5.315781 1.014852 2.828906
H  -6.500732 0.756079 1.535096
H  0.181356 -3.630646 0.893146
H  1.115318 -2.891845 -0.419005
H  1.096779 -2.131444 1.185638
elementType: O C H
totalener: -1459.13133403 hartree
nucrepener: 3400.97203373 hartree
electener: -4860.10336776 hartree
oneelecener: -8753.20233427 hartree
twoeener: 3893.09896651 hartree
cpcmener: -0.04434672 hartree
kineticenergy: 1452.85042510 hartree
xcener: -140.276916687762 hartree
chargesum: 0.0000000
charge: -0.234204 -0.316864 -0.452221 -0.284255 -0.284805 -0.495325 -0.151803 -0.070354 -0.134232 0.052424 -0.126002 -0.117851 0.180432 0.426537 -0.293190 -0.134575 -0.168275 0.344541 -0.250359 -0.269790 0.104121 -0.156934 0.059066 -0.138359 -0.207556 -0.130383 -0.167936 -0.155544 0.482836 0.193104 -0.143407 -0.141894 0.091893 0.098742 0.070710 0.083322 0.062069 0.076422 0.120543 0.099354 0.115737 0.151860 0.125521 0.134975 0.062472 0.084748 0.100474 0.127125 0.121888 0.136518 0.141811 0.157334 0.155898 0.122184 0.120767 0.116299 0.124689 0.133581 0.133262 0.112859
qa: -0.2342 -0.3169 -0.4522 -0.2843 -0.2848 -0.4953 -0.1518 -0.0704 -0.1342 0.0524 -0.1260 -0.1179 0.1804 0.4265 -0.2932 -0.1346 -0.1683 0.3445 -0.2504 -0.2698 0.1041 -0.1569 0.0591 -0.1384 -0.2076 -0.1304 -0.1679 -0.1555 0.4828 0.1931 -0.1434 -0.1419 0.0919 0.0987 0.0707 0.0833 0.0621 0.0764 0.1205 0.0994 0.1157 0.1519 0.1255 0.1350 0.0625 0.0847 0.1005 0.1271 0.1219 0.1365 0.1418 0.1573 0.1559 0.1222 0.1208 0.1163 0.1247 0.1336 0.1333 0.1129
va: 2.1914 2.0888 2.0618 2.1254 2.0951 2.0153 3.8728 3.3736 3.8762 3.5924 3.6369 3.8928 4.0264 4.2361 3.9454 3.8389 3.9236 3.7145 3.9700 3.9264 3.7520 3.6937 3.3942 3.8985 3.9667 3.4491 3.9140 3.9060 4.1373 3.9395 3.8763 3.8484 1.0242 1.0007 1.0039 1.0088 1.0150 1.0040 0.9910 1.0086 0.9969 0.9946 1.0336 1.0207 0.9992 0.9969 1.0037 0.9883 0.9983 1.0022 1.0093 0.9908 0.9920 1.0276 0.9943 0.9929 0.9952 0.9913 0.9905 0.9797
dispcorr: -0.038032756 hartree
energy: -1459.169366786520
dipole: 21.96231 -22.13108 -0.16877 -14.56480 13.93808 -0.62672 2.94946 -1.25084 1.69863
magnitude: 1.81840 au
magnitude: 4.62202 debye
