program: Orca
programVersion: 5.0.4
elementType: O O O O O O C C C C C C C C C C C C C C C C C C C C C C C C C C H H H H H H H H H H H H H H H H H H H H H H H H H H H H
charge: 0
multiplicity: 1
keywords: wb97x-d3
keywords: def2-TZVPP
keywords: def2/J RIJCOSX
keywords: DEFGRID2
keywords: scfconv7
keywords: smallprint printgap noloewdin
keywords: NOSOSCF
formula: C26H28O6
InChI: InChI=1/C26H28O6/c1-5-6-10-21-17(2)20-13-12-19(14-24(20)32-26(21)28)31-15-18-9-7-8-11-22(18)23(16-29-3)25(27)30-4/h7-9,11-14,16H,5-6,10,15H2,1-4H3
60 atoms
O  1.580763 -0.71056 0.562166
O  -1.793279 2.573382 1.056906
O  3.020066 -2.311266 0.234639
O  -4.824827 -2.135343 1.527964
O  -1.416074 -2.219812 -0.607047
O  -5.452282 -0.191919 0.62516
C  5.325971 -0.689514 0.544586
C  3.925453 -0.163065 0.676173
C  5.854968 -0.574836 -0.886398
C  3.615084 1.142461 0.896448
C  2.227687 1.5454 0.953856
C  7.258839 -1.14403 -1.042405
C  1.244568 0.578566 0.779482
C  2.864103 -1.135773 0.474978
C  4.652001 2.203697 1.069304
C  1.788542 2.861572 1.164208
C  -0.112499 0.863057 0.807271
C  -0.512824 2.173997 1.011815
C  0.451576 3.176554 1.191734
C  7.803756 -0.989469 -2.454297
C  -2.826108 1.634233 0.790675
C  -2.884387 1.236883 -0.663431
C  -3.175612 -0.073859 -1.056315
C  -2.65837 2.206208 -1.638229
C  -3.222654 -0.38027 -2.416104
C  -3.418791 -1.158233 -0.074269
C  -2.704072 1.888085 -2.985584
C  -2.986786 0.587606 -3.377958
C  -4.653778 -1.100054 0.711459
C  -2.547424 -2.175093 0.076307
C  -5.995133 -2.14527 2.341593
C  -0.574947 -3.347339 -0.37562
H  5.995508 -0.158555 1.223411
H  5.355198 -1.734279 0.858573
H  5.849428 0.477621 -1.188738
H  5.172626 -1.091837 -1.568585
H  7.932268 -0.649477 -0.335327
H  7.252479 -2.202581 -0.765218
H  5.665758 1.816535 1.042646
H  4.565252 2.954208 0.281168
H  4.51899 2.724115 2.019555
H  2.510226 3.654753 1.304291
H  -0.811454 0.053118 0.662287
H  0.133833 4.198967 1.350908
H  8.806036 -1.411014 -2.544948
H  7.863582 0.06157 -2.744556
H  7.168629 -1.49509 -3.184533
H  -2.725346 0.764588 1.446221
H  -3.74398 2.147805 1.079696
H  -2.437114 3.22508 -1.344809
H  -3.453359 -1.393721 -2.720692
H  -2.522282 2.655656 -3.72683
H  -3.026258 0.327841 -4.427958
H  -2.730545 -2.987337 0.774982
H  -6.029113 -1.283863 3.009584
H  -6.904732 -2.171739 1.740898
H  -5.936084 -3.052929 2.936723
H  0.332789 -3.18926 -0.951411
H  -0.316432 -3.442038 0.680422
H  -1.055635 -4.266472 -0.715525
elementType: O C H
totalener: -1459.13954735 hartree
nucrepener: 3220.21261926 hartree
electener: -4679.35216661 hartree
oneelecener: -8392.05295145 hartree
twoeener: 3712.70078484 hartree
cpcmener: -0.04075497 hartree
kineticenergy: 1452.82817829 hartree
xcener: -140.265365063923 hartree
chargesum: 0.0000000
charge: -0.242589 -0.321443 -0.474693 -0.296652 -0.284622 -0.480178 -0.121722 0.029644 -0.128729 -0.003729 -0.040442 -0.093032 0.093663 0.371442 -0.298934 -0.097718 -0.118926 0.291338 -0.259828 -0.276119 0.086877 -0.155757 0.094844 -0.146783 -0.201884 -0.140375 -0.164677 -0.155226 0.463434 0.213760 -0.126001 -0.145968 0.095085 0.088947 0.071612 0.078862 0.057766 0.060306 0.100379 0.119038 0.115985 0.153760 0.114836 0.137587 0.090240 0.077345 0.078975 0.123482 0.127055 0.138207 0.140385 0.156750 0.156072 0.121918 0.113414 0.114439 0.122164 0.120044 0.121381 0.134990
qa: -0.2426 -0.3214 -0.4747 -0.2967 -0.2846 -0.4802 -0.1217 0.0296 -0.1287 -0.0037 -0.0404 -0.0930 0.0937 0.3714 -0.2989 -0.0977 -0.1189 0.2913 -0.2598 -0.2761 0.0869 -0.1558 0.0948 -0.1468 -0.2019 -0.1404 -0.1647 -0.1552 0.4634 0.2138 -0.1260 -0.1460 0.0951 0.0889 0.0716 0.0789 0.0578 0.0603 0.1004 0.1190 0.1160 0.1538 0.1148 0.1376 0.0902 0.0773 0.0790 0.1235 0.1271 0.1382 0.1404 0.1568 0.1561 0.1219 0.1134 0.1144 0.1222 0.1200 0.1214 0.1350
va: 2.2086 2.0891 2.0381 2.0944 2.1117 2.0358 3.8256 3.4812 3.8402 3.7283 3.7463 3.8706 4.1633 4.2445 3.9452 3.8912 3.8076 3.8100 4.0583 3.9462 3.7944 3.6826 3.4663 3.9015 3.9761 3.4624 3.9140 3.9045 4.1546 3.9503 3.8767 3.8484 1.0020 1.0259 1.0084 1.0155 1.0077 1.0081 1.0067 0.9911 0.9955 0.9935 1.0297 1.0146 1.0042 1.0011 1.0010 0.9961 0.9932 1.0136 1.0068 0.9910 0.9916 1.0223 0.9930 0.9924 0.9956 1.0017 0.9883 0.9883
dispcorr: -0.031554823 hartree
energy: -1459.171102173346
dipole: 34.95250 -33.87729 1.07522 -5.13772 5.36416 0.22644 -5.80493 6.67634 0.87141
magnitude: 1.40240 au
magnitude: 3.56462 debye
