program: Orca
programVersion: 5.0.4
elementType: O O O O O O C C C C C C C C C C C C C C C C C C C C C C C C C C H H H H H H H H H H H H H H H H H H H H H H H H H H H H
charge: 0
multiplicity: 1
keywords: wb97x-d3
keywords: def2-TZVPP
keywords: def2/J RIJCOSX
keywords: DEFGRID2
keywords: scfconv7
keywords: smallprint printgap noloewdin
keywords: NOSOSCF
formula: C26H28O6
InChI: InChI=1/C26H28O6/c1-5-6-10-21-17(2)20-13-12-19(14-24(20)32-26(21)28)31-15-18-9-7-8-11-22(18)23(16-29-3)25(27)30-4/h7-9,11-14,16H,5-6,10,15H2,1-4H3
60 atoms
O  1.800664 1.924609 0.351351
O  -1.978916 0.919525 -2.315984
O  3.393831 2.381729 1.762131
O  -0.592017 -1.357893 0.728455
O  -4.575239 -0.894986 -1.619161
O  -1.18066 -2.991184 -0.673726
C  5.169574 0.341882 0.843919
C  3.81987 0.612479 0.237485
C  5.182313 -0.861689 1.792064
C  3.300839 -0.100105 -0.79797
C  1.963122 0.187233 -1.2644
C  4.261043 -0.732725 2.998478
C  1.244701 1.202443 -0.643962
C  3.037375 1.675718 0.846989
C  4.046683 -1.207154 -1.468504
C  1.305259 -0.527927 -2.276298
C  -0.063816 1.520491 -0.978533
C  -0.697353 0.764741 -1.95252
C  0.002619 -0.254577 -2.614213
C  4.343104 -1.942231 3.917245
C  -2.832584 1.745374 -1.55088
C  -2.99625 1.381931 -0.091796
C  -2.908894 0.089071 0.43994
C  -3.291289 2.445871 0.761254
C  -3.111371 -0.084694 1.812055
C  -2.624058 -1.118437 -0.370741
C  -3.503995 2.2561 2.114844
C  -3.408843 0.97782 2.64634
C  -1.419339 -1.92675 -0.141128
C  -3.456997 -1.541428 -1.336988
C  0.604055 -2.056584 1.059615
C  -5.325389 -1.374883 -2.729856
H  5.903333 0.177286 0.052565
H  5.512721 1.225744 1.382418
H  6.209659 -1.00881 2.139687
H  4.918938 -1.766988 1.235241
H  4.51284 0.171818 3.559658
H  3.225836 -0.607045 2.665987
H  5.073929 -1.293745 -1.128249
H  3.555636 -2.165545 -1.285815
H  4.067018 -1.061575 -2.549763
H  1.816179 -1.329498 -2.79187
H  -0.555567 2.324782 -0.448705
H  -0.498881 -0.834485 -3.37821
H  5.353993 -2.080325 4.306375
H  4.066328 -2.859263 3.392494
H  3.674215 -1.840371 4.773222
H  -2.506205 2.788762 -1.621376
H  -3.797465 1.68836 -2.057732
H  -3.345606 3.448344 0.351867
H  -3.047971 -1.082755 2.22812
H  -3.731001 3.101679 2.751112
H  -3.56435 0.808802 3.704053
H  -3.237548 -2.434683 -1.917593
H  0.387687 -2.977235 1.604022
H  1.198757 -2.295012 0.178237
H  1.1716 -1.390444 1.705163
H  -4.769841 -1.252746 -3.661168
H  -5.594984 -2.42499 -2.602572
H  -6.233523 -0.779376 -2.777639
elementType: O C H
totalener: -1459.13246982 hartree
nucrepener: 3415.89556211 hartree
electener: -4875.02803192 hartree
oneelecener: -8783.40118392 hartree
twoeener: 3908.37315200 hartree
cpcmener: -0.04532045 hartree
kineticenergy: 1452.84599901 hartree
xcener: -140.275648483148 hartree
chargesum: 0.0000000
charge: -0.233111 -0.319742 -0.453560 -0.273574 -0.289425 -0.492019 -0.127717 -0.056914 -0.137177 0.024450 -0.131212 -0.086823 0.221048 0.408287 -0.292629 -0.099305 -0.214692 0.358284 -0.275836 -0.282603 0.108294 -0.172463 0.084583 -0.127478 -0.224040 -0.135215 -0.173065 -0.150699 0.450932 0.236244 -0.153019 -0.131038 0.100373 0.092694 0.077177 0.070115 0.067468 0.050844 0.100958 0.120472 0.116515 0.150774 0.125940 0.135233 0.081778 0.077147 0.091289 0.120860 0.122477 0.136383 0.138630 0.157246 0.156031 0.106958 0.139633 0.107004 0.129701 0.122460 0.122414 0.122659
qa: -0.2331 -0.3197 -0.4536 -0.2736 -0.2894 -0.4920 -0.1277 -0.0569 -0.1372 0.0244 -0.1312 -0.0868 0.2210 0.4083 -0.2926 -0.0993 -0.2147 0.3583 -0.2758 -0.2826 0.1083 -0.1725 0.0846 -0.1275 -0.2240 -0.1352 -0.1731 -0.1507 0.4509 0.2362 -0.1530 -0.1310 0.1004 0.0927 0.0772 0.0701 0.0675 0.0508 0.1010 0.1205 0.1165 0.1508 0.1259 0.1352 0.0818 0.0771 0.0913 0.1209 0.1225 0.1364 0.1386 0.1572 0.1560 0.1070 0.1396 0.1070 0.1297 0.1225 0.1224 0.1227
va: 2.1896 2.0807 2.0599 2.1046 2.1299 2.0160 3.8565 3.3809 3.8693 3.6340 3.6312 3.8526 3.9536 4.2774 3.9472 3.8316 3.9269 3.6930 3.9951 3.9509 3.7360 3.6973 3.3605 3.8821 3.9898 3.4600 3.9214 3.9013 4.1466 3.9728 3.8648 3.8571 1.0014 1.0274 1.0122 1.0037 1.0146 1.0076 1.0077 0.9905 0.9970 0.9940 1.0325 1.0146 1.0015 1.0010 1.0031 0.9980 0.9931 1.0021 1.0107 0.9909 0.9917 1.0284 0.9978 0.9904 0.9946 0.9860 0.9866 0.9942
dispcorr: -0.037957683 hartree
energy: -1459.170427501066
dipole: 18.40544 -19.83381 -1.42838 -14.86729 13.61618 -1.25111 9.37851 -11.45035 -2.07184
magnitude: 2.81035 au
magnitude: 7.14333 debye
