program: Orca
programVersion: 5.0.4
elementType: O O O O O O C C C C C C C C C C C C C C C C C C C C C C C C C C H H H H H H H H H H H H H H H H H H H H H H H H H H H H
charge: 0
multiplicity: 1
keywords: wb97x-d3
keywords: def2-TZVPP
keywords: def2/J RIJCOSX
keywords: DEFGRID2
keywords: scfconv7
keywords: smallprint printgap noloewdin
keywords: NOSOSCF
formula: C26H28O6
InChI: InChI=1/C26H28O6/c1-5-6-10-21-17(2)20-13-12-19(14-24(20)32-26(21)28)31-15-18-9-7-8-11-22(18)23(16-29-3)25(27)30-4/h7-9,11-14,16H,5-6,10,15H2,1-4H3
60 atoms
O  1.91761 0.928947 -1.030831
O  -1.885286 -1.81523 -1.703257
O  3.573959 2.319198 -0.768376
O  -1.340629 0.49833 1.527255
O  -4.944643 -1.554013 -0.570841
O  -2.283025 -1.25875 2.529937
C  4.82052 0.889888 1.334834
C  3.546997 0.440565 0.677613
C  6.057492 0.327288 0.63095
C  2.894837 -0.714303 0.977109
C  1.682915 -1.052454 0.264349
C  7.373495 0.732485 1.286431
C  1.225791 -0.189846 -0.725357
C  3.055711 1.29318 -0.39229
C  3.372076 -1.666111 2.024741
C  0.905421 -2.190972 0.522142
C  0.055132 -0.405619 -1.438956
C  -0.708623 -1.521426 -1.130997
C  -0.267161 -2.4245 -0.153275
C  7.663446 2.225199 1.225844
C  -2.529028 -0.861288 -2.522838
C  -2.866531 0.46235 -1.875253
C  -3.165682 0.647781 -0.51971
C  -2.904951 1.561111 -2.733944
C  -3.480363 1.935236 -0.074942
C  -3.181827 -0.449826 0.476202
C  -3.233971 2.826366 -2.28208
C  -3.519566 3.015985 -0.937448
C  -2.250967 -0.464647 1.611993
C  -4.053905 -1.47028 0.402501
C  -0.403769 0.621905 2.592885
C  -5.753811 -2.726519 -0.593752
H  4.856917 1.979765 1.340394
H  4.832644 0.589303 2.384354
H  6.056674 0.647994 -0.415788
H  5.985564 -0.764425 0.614975
H  7.377324 0.39917 2.329313
H  8.186588 0.19134 0.794925
H  2.617297 -1.797988 2.802901
H  3.557091 -2.650743 1.591611
H  4.29004 -1.343284 2.505863
H  1.216422 -2.897315 1.279591
H  -0.234514 0.312291 -2.194351
H  -0.865275 -3.297211 0.074367
H  7.652859 2.588302 0.1958
H  8.646268 2.451706 1.642127
H  6.934802 2.811665 1.78751
H  -1.931941 -0.674329 -3.42203
H  -3.442827 -1.356419 -2.855562
H  -2.660782 1.419328 -3.780822
H  -3.713617 2.085681 0.972155
H  -3.255312 3.659636 -2.972486
H  -3.771012 3.99958 -0.562138
H  -4.054889 -2.262889 1.147703
H  0.157062 -0.297587 2.757918
H  0.281991 1.412059 2.297917
H  -0.897449 0.910216 3.522359
H  -5.150309 -3.61617 -0.780195
H  -6.301456 -2.848121 0.342635
H  -6.464614 -2.602497 -1.40669
elementType: O C H
totalener: -1459.13326547 hartree
nucrepener: 3346.36726909 hartree
electener: -4805.50053456 hartree
oneelecener: -8644.49746286 hartree
twoeener: 3838.99692830 hartree
cpcmener: -0.04511795 hartree
kineticenergy: 1452.84217588 hartree
xcener: -140.273739553300 hartree
chargesum: -0.0000000
charge: -0.233448 -0.318656 -0.456159 -0.273720 -0.289745 -0.492373 -0.123767 -0.031371 -0.132780 0.015311 -0.135331 -0.110068 0.211876 0.395951 -0.288024 -0.102249 -0.215644 0.352121 -0.267772 -0.275791 0.107773 -0.172893 0.084950 -0.124866 -0.224462 -0.137045 -0.174022 -0.150297 0.452058 0.235672 -0.148592 -0.131364 0.091734 0.095689 0.082400 0.083664 0.056106 0.068915 0.114829 0.118369 0.101113 0.150823 0.125403 0.134644 0.081158 0.090890 0.079823 0.120793 0.122822 0.136367 0.138986 0.157228 0.156680 0.107157 0.107190 0.125009 0.138571 0.123207 0.122316 0.122838
qa: -0.2334 -0.3187 -0.4562 -0.2737 -0.2897 -0.4924 -0.1238 -0.0314 -0.1328 0.0153 -0.1353 -0.1101 0.2119 0.3960 -0.2880 -0.1022 -0.2156 0.3521 -0.2678 -0.2758 0.1078 -0.1729 0.0850 -0.1249 -0.2245 -0.1370 -0.1740 -0.1503 0.4521 0.2357 -0.1486 -0.1314 0.0917 0.0957 0.0824 0.0837 0.0561 0.0689 0.1148 0.1184 0.1011 0.1508 0.1254 0.1346 0.0812 0.0909 0.0798 0.1208 0.1228 0.1364 0.1390 0.1572 0.1567 0.1072 0.1072 0.1250 0.1386 0.1232 0.1223 0.1228
va: 2.1884 2.0815 2.0601 2.1033 2.1299 2.0148 3.8255 3.3984 3.8501 3.6783 3.6179 3.8872 3.9784 4.3083 3.9516 3.8244 3.9291 3.7046 3.9859 3.9312 3.7342 3.6995 3.3621 3.8786 3.9926 3.4624 3.9220 3.9026 4.1436 3.9733 3.8703 3.8569 1.0224 1.0004 1.0145 1.0118 1.0082 1.0069 0.9948 0.9918 1.0074 0.9942 1.0325 1.0146 1.0008 1.0039 0.9987 0.9978 0.9930 1.0022 1.0104 0.9909 0.9915 1.0281 0.9905 0.9940 0.9966 0.9857 0.9866 0.9942
dispcorr: -0.036141432 hartree
energy: -1459.169406900131
dipole: 27.81366 -29.37722 -1.56356 -0.60604 -1.70263 -2.30867 11.51956 -11.24271 0.27685
magnitude: 2.80202 au
magnitude: 7.12218 debye
