program: Orca
programVersion: 5.0.4
elementType: O O O O O O C C C C C C C C C C C C C C C C C C C C C C C C C C H H H H H H H H H H H H H H H H H H H H H H H H H H H H
charge: 0
multiplicity: 1
keywords: wb97x-d3
keywords: def2-TZVPP
keywords: def2/J RIJCOSX
keywords: DEFGRID2
keywords: scfconv7
keywords: smallprint printgap noloewdin
keywords: NOSOSCF
formula: C26H28O6
InChI: InChI=1/C26H28O6/c1-5-6-10-21-17(2)20-13-12-19(14-24(20)32-26(21)28)31-15-18-9-7-8-11-22(18)23(16-29-3)25(27)30-4/h7-9,11-14,16H,5-6,10,15H2,1-4H3
60 atoms
O  1.926526 1.016356 -0.981868
O  -1.878972 -1.657811 -1.879031
O  3.582618 2.379876 -0.60089
O  -1.327753 0.359058 1.552219
O  -4.90375 -1.570384 -0.701393
O  -2.2687 -1.45974 2.43855
C  4.807681 0.796999 1.399841
C  3.546136 0.393221 0.692374
C  6.062058 0.32763 0.658554
C  2.896274 -0.784405 0.889775
C  1.68834 -1.063702 0.146149
C  7.361029 0.677138 1.377409
C  1.23221 -0.121505 -0.768405
C  3.059238 1.329622 -0.307542
C  3.367426 -1.820045 1.858144
C  0.911001 -2.219936 0.307058
C  0.059487 -0.274642 -1.49464
C  -0.702911 -1.412934 -1.282784
C  -0.261595 -2.395606 -0.385481
C  7.615602 2.171917 1.508128
C  -2.531516 -0.630944 -2.597302
C  -2.883341 0.616919 -1.819096
C  -3.178147 0.664839 -0.450954
C  -2.944812 1.79388 -2.56603
C  -3.513244 1.897333 0.117617
C  -3.166571 -0.519773 0.439835
C  -3.292777 3.003545 -1.99231
C  -3.575458 3.056247 -0.634737
C  -2.235349 -0.610024 1.57252
C  -4.011782 -1.55148 0.274558
C  -0.393433 0.415849 2.625066
C  -5.674233 -2.760514 -0.835188
H  4.824527 1.881985 1.509936
H  4.816559 0.397985 2.415629
H  6.072283 0.75844 -0.347467
H  6.00668 -0.756971 0.525367
H  7.360229 0.216922 2.370748
H  8.192113 0.219479 0.834012
H  3.550218 -2.766855 1.346638
H  4.284986 -1.542111 2.367028
H  2.608605 -2.012091 2.619647
H  1.22209 -2.987566 1.002253
H  -0.231948 0.504427 -2.18603
H  -0.861208 -3.28377 -0.23308
H  6.873262 2.664174 2.138232
H  7.595777 2.663135 0.532834
H  8.592637 2.366811 1.953218
H  -1.937023 -0.348375 -3.473025
H  -3.441025 -1.097383 -2.979832
H  -2.703678 1.758284 -3.622436
H  -3.744173 1.940436 1.175144
H  -3.331707 3.89928 -2.598603
H  -3.843173 3.993481 -0.164068
H  -3.989985 -2.40739 0.945496
H  0.176197 -0.508196 2.724096
H  0.284865 1.23184 2.388984
H  -0.890157 0.631244 3.572708
H  -6.394041 -2.582434 -1.630064
H  -5.043529 -3.608023 -1.108567
H  -6.212044 -2.990041 0.086611
elementType: O C H
totalener: -1459.13335747 hartree
nucrepener: 3346.08921958 hartree
electener: -4805.22257705 hartree
oneelecener: -8643.89770445 hartree
twoeener: 3838.67512740 hartree
cpcmener: -0.04509464 hartree
kineticenergy: 1452.84482443 hartree
xcener: -140.274016009794 hartree
chargesum: 0.0000000
charge: -0.233300 -0.318520 -0.456722 -0.273888 -0.290048 -0.491545 -0.127680 -0.026345 -0.131889 0.008690 -0.126266 -0.110424 0.206168 0.396927 -0.286830 -0.103734 -0.213610 0.350671 -0.267820 -0.277630 0.106057 -0.172699 0.084146 -0.124580 -0.225726 -0.136977 -0.175333 -0.149232 0.453786 0.236250 -0.149182 -0.130606 0.092580 0.095957 0.082856 0.083298 0.056565 0.068760 0.117910 0.100534 0.115406 0.151435 0.124834 0.135348 0.080392 0.081990 0.091112 0.121194 0.122878 0.136075 0.139249 0.157042 0.156873 0.106886 0.107563 0.125603 0.137910 0.122781 0.122971 0.121890
qa: -0.2333 -0.3185 -0.4567 -0.2739 -0.2900 -0.4915 -0.1277 -0.0263 -0.1319 0.0087 -0.1263 -0.1104 0.2062 0.3969 -0.2868 -0.1037 -0.2136 0.3507 -0.2678 -0.2776 0.1061 -0.1727 0.0841 -0.1246 -0.2257 -0.1370 -0.1753 -0.1492 0.4538 0.2363 -0.1492 -0.1306 0.0926 0.0960 0.0829 0.0833 0.0566 0.0688 0.1179 0.1005 0.1154 0.1514 0.1248 0.1353 0.0804 0.0820 0.0911 0.1212 0.1229 0.1361 0.1392 0.1570 0.1569 0.1069 0.1076 0.1256 0.1379 0.1228 0.1230 0.1219
va: 2.1892 2.0810 2.0595 2.1013 2.1296 2.0165 3.8256 3.3901 3.8472 3.6849 3.6185 3.8854 3.9845 4.3070 3.9510 3.8260 3.9292 3.7078 3.9839 3.9311 3.7371 3.6980 3.3654 3.8805 3.9899 3.4576 3.9233 3.9000 4.1406 3.9717 3.8701 3.8569 1.0212 1.0002 1.0151 1.0123 1.0082 1.0071 0.9920 1.0079 0.9943 0.9941 1.0324 1.0140 0.9984 1.0005 1.0039 0.9975 0.9931 1.0024 1.0098 0.9910 0.9913 1.0279 0.9902 0.9938 0.9970 0.9941 0.9859 0.9869
dispcorr: -0.036137944 hartree
energy: -1459.169495410109
dipole: 27.73330 -29.27362 -1.54032 -1.37022 -0.96836 -2.33859 11.75608 -11.67645 0.07964
magnitude: 2.80141 au
magnitude: 7.12062 debye
