program: Orca
programVersion: 5.0.4
elementType: O O O O O O C C C C C C C C C C C C C C C C C C C C C C C C C C H H H H H H H H H H H H H H H H H H H H H H H H H H H H
charge: 0
multiplicity: 1
keywords: wb97x-d3
keywords: def2-TZVPP
keywords: def2/J RIJCOSX
keywords: DEFGRID2
keywords: scfconv7
keywords: smallprint printgap noloewdin
keywords: NOSOSCF
formula: C26H28O6
InChI: InChI=1/C26H28O6/c1-5-6-10-21-17(2)20-13-12-19(14-24(20)32-26(21)28)31-15-18-9-7-8-11-22(18)23(16-29-3)25(27)30-4/h7-9,11-14,16H,5-6,10,15H2,1-4H3
60 atoms
O  1.82081 1.730229 -0.527614
O  -1.92057 -0.406629 -2.492503
O  3.399907 2.816726 0.50659
O  -1.060615 -0.69434 1.39313
O  -4.824459 -1.302701 -1.260866
O  -1.782181 -2.779725 1.061349
C  5.054747 0.555998 0.95924
C  3.736325 0.484392 0.243193
C  4.900144 0.323578 2.464822
C  3.170414 -0.669363 -0.199774
C  1.870571 -0.628602 -0.831109
C  6.203863 0.446201 3.246984
C  1.233469 0.598652 -0.971586
C  3.018687 1.741442 0.106136
C  3.824472 -2.004051 -0.048035
C  1.180469 -1.758323 -1.294748
C  -0.022504 0.740862 -1.544252
C  -0.686693 -0.399787 -1.967603
C  -0.072695 -1.654345 -1.847301
C  7.258767 -0.581018 2.858921
C  -2.715241 0.760649 -2.437897
C  -3.01561 1.300466 -1.057975
C  -3.148167 0.522775 0.099011
C  -3.201098 2.680413 -0.971495
C  -3.455006 1.161327 1.30358
C  -2.986444 -0.9503 0.12112
C  -3.51737 3.2975 0.226321
C  -3.64253 2.530209 1.375698
C  -1.909329 -1.584857 0.891585
C  -3.815936 -1.770513 -0.54537
C  0.010793 -1.183834 2.194353
C  -5.578018 -2.257231 -2.000756
H  5.745324 -0.17291 0.534096
H  5.513714 1.532523 0.79065
H  4.467499 -0.668809 2.632275
H  4.175753 1.041314 2.860799
H  6.610054 1.454706 3.122575
H  5.978738 0.342156 4.311713
H  4.802352 -1.949803 0.420352
H  3.204554 -2.665756 0.56062
H  3.947352 -2.488902 -1.018557
H  1.628025 -2.738873 -1.205119
H  -0.44991 1.731206 -1.621342
H  -0.599604 -2.538296 -2.183742
H  8.132603 -0.512174 3.509067
H  7.610902 -0.445266 1.835009
H  6.870236 -1.599148 2.940507
H  -2.259885 1.5538 -3.04094
H  -3.644643 0.486061 -2.940121
H  -3.082943 3.28386 -1.864663
H  -3.561621 0.564082 2.201236
H  -3.654258 4.370769 0.263151
H  -3.88373 2.994212 2.323629
H  -3.680721 -2.849363 -0.519969
H  0.626638 -1.908551 1.659638
H  0.618381 -0.317683 2.448882
H  -0.358905 -1.640722 3.114854
H  -6.395961 -1.717131 -2.471065
H  -4.968761 -2.725637 -2.775659
H  -5.991143 -3.028115 -1.347696
elementType: O C H
totalener: -1459.13345306 hartree
nucrepener: 3356.57331362 hartree
electener: -4815.70676667 hartree
oneelecener: -8664.77645480 hartree
twoeener: 3849.06968813 hartree
cpcmener: -0.04497761 hartree
kineticenergy: 1452.83974062 hartree
xcener: -140.272616751052 hartree
chargesum: 0.0000000
charge: -0.233885 -0.316964 -0.455318 -0.273008 -0.290034 -0.490610 -0.130418 -0.019563 -0.132915 0.008472 -0.118494 -0.108744 0.205182 0.396506 -0.281263 -0.122536 -0.210030 0.336131 -0.253227 -0.281695 0.108522 -0.173051 0.087885 -0.126544 -0.227368 -0.137023 -0.172700 -0.150327 0.446510 0.236183 -0.147685 -0.130224 0.098527 0.090789 0.077450 0.085504 0.058952 0.068319 0.096291 0.115539 0.118668 0.151239 0.127645 0.136157 0.094617 0.080839 0.080154 0.121035 0.122417 0.136895 0.140148 0.157082 0.156948 0.107102 0.107450 0.123967 0.137363 0.122091 0.123103 0.121941
qa: -0.2339 -0.3170 -0.4553 -0.2730 -0.2900 -0.4906 -0.1304 -0.0196 -0.1329 0.0085 -0.1185 -0.1087 0.2052 0.3965 -0.2813 -0.1225 -0.2100 0.3361 -0.2532 -0.2817 0.1085 -0.1731 0.0879 -0.1265 -0.2274 -0.1370 -0.1727 -0.1503 0.4465 0.2362 -0.1477 -0.1302 0.0985 0.0908 0.0774 0.0855 0.0590 0.0683 0.0963 0.1155 0.1187 0.1512 0.1276 0.1362 0.0946 0.0808 0.0802 0.1210 0.1224 0.1369 0.1401 0.1571 0.1569 0.1071 0.1074 0.1240 0.1374 0.1221 0.1231 0.1219
va: 2.1876 2.0833 2.0613 2.1018 2.1299 2.0170 3.8245 3.3851 3.8611 3.6873 3.6120 3.8856 3.9871 4.3133 3.9515 3.8323 3.9284 3.7351 3.9723 3.9276 3.7333 3.7043 3.3618 3.8767 3.9915 3.4647 3.9210 3.9026 4.1495 3.9764 3.8702 3.8573 0.9980 1.0244 1.0076 1.0182 1.0087 1.0076 1.0074 0.9914 0.9959 0.9951 1.0316 1.0140 1.0048 0.9983 1.0006 0.9978 0.9934 1.0023 1.0098 0.9909 0.9913 1.0278 0.9904 0.9945 0.9968 0.9942 0.9857 0.9870
dispcorr: -0.036340905 hartree
energy: -1459.169793960338
dipole: 25.51205 -26.92154 -1.40949 -9.93955 7.85386 -2.08568 13.74129 -14.86374 -1.12245
magnitude: 2.75620 au
magnitude: 7.00570 debye
