program: Orca
programVersion: 5.0.4
elementType: O O O O O O C C C C C C C C C C C C C C C C C C C C C C C C C C H H H H H H H H H H H H H H H H H H H H H H H H H H H H
charge: 0
multiplicity: 1
keywords: wb97x-d3
keywords: def2-TZVPP
keywords: def2/J RIJCOSX
keywords: DEFGRID2
keywords: scfconv7
keywords: smallprint printgap noloewdin
keywords: NOSOSCF
formula: C26H28O6
InChI: InChI=1/C26H28O6/c1-5-6-10-21-17(2)20-13-12-19(14-24(20)32-26(21)28)31-15-18-9-7-8-11-22(18)23(16-29-3)25(27)30-4/h7-9,11-14,16H,5-6,10,15H2,1-4H3
60 atoms
O  1.822343 1.725522 -0.536912
O  -1.917582 -0.423477 -2.491547
O  3.396255 2.816937 0.500889
O  -1.059785 -0.691821 1.393312
O  -4.834835 -1.30166 -1.244784
O  -1.789144 -2.776785 1.074952
C  5.054381 0.560382 0.96075
C  3.736995 0.484806 0.243524
C  4.899919 0.334957 2.46712
C  3.173494 -0.671161 -0.197144
C  1.874057 -0.634572 -0.829876
C  6.204187 0.461815 3.247801
C  1.235951 0.591583 -0.9764
C  3.019161 1.740629 0.099108
C  3.829178 -2.004087 -0.040116
C  1.184899 -1.766989 -1.288488
C  -0.019897 0.730387 -1.550164
C  -0.683512 -0.412982 -1.967614
C  -0.068255 -1.666494 -1.841402
C  7.261537 -0.562894 2.860616
C  -2.712909 0.743676 -2.44468
C  -3.010601 1.294042 -1.068597
C  -3.145239 0.524731 0.093698
C  -3.192564 2.674891 -0.991862
C  -3.451499 1.172719 1.293253
C  -2.988016 -0.948837 0.125021
C  -3.508026 3.301274 0.200921
C  -3.636027 2.542438 1.355467
C  -1.911491 -1.582449 0.89702
C  -3.824608 -1.770092 -0.531922
C  0.009375 -1.178725 2.1986
C  -5.597157 -2.256371 -1.975523
H  5.745208 -0.170471 0.539645
H  5.512985 1.535918 0.787424
H  4.467694 -0.656665 2.639161
H  4.175945 1.054475 2.860295
H  6.607575 1.471244 3.121247
H  5.980387 0.358733 4.313043
H  3.210108 -2.664572 0.570567
H  3.953499 -2.491748 -1.008889
H  4.806639 -1.946472 0.428732
H  1.633281 -2.746608 -1.194296
H  -0.447793 1.72008 -1.632618
H  -0.593946 -2.552444 -2.173794
H  8.138565 -0.485193 3.505141
H  7.607111 -0.432102 1.834004
H  6.878583 -1.58215 2.951199
H  -2.259536 1.53268 -3.054419
H  -3.642745 0.463893 -2.94281
H  -3.07306 3.271807 -1.889043
H  -3.560206 0.582238 2.19494
H  -3.641949 4.374958 0.229926
H  -3.876685 3.013863 2.299658
H  -3.696889 -2.849592 -0.497432
H  -0.361949 -1.626557 3.122019
H  0.622699 -1.909127 1.670364
H  0.61833 -0.312653 2.44604
H  -6.412661 -1.713507 -2.446806
H  -4.993123 -2.73371 -2.748962
H  -6.013223 -3.020174 -1.315978
elementType: O C H
totalener: -1459.13347445 hartree
nucrepener: 3355.99233084 hartree
electener: -4815.12580528 hartree
oneelecener: -8663.62250825 hartree
twoeener: 3848.49670297 hartree
cpcmener: -0.04501425 hartree
kineticenergy: 1452.84705876 hartree
xcener: -140.274079247366 hartree
chargesum: -0.0000000
charge: -0.233866 -0.316956 -0.455380 -0.273167 -0.289961 -0.490869 -0.130741 -0.019082 -0.132570 0.008568 -0.117965 -0.108895 0.204242 0.396411 -0.281371 -0.122512 -0.209850 0.335521 -0.252790 -0.281652 0.109380 -0.172741 0.088940 -0.126532 -0.228110 -0.137309 -0.172495 -0.150223 0.446425 0.235565 -0.147788 -0.130433 0.098465 0.090909 0.077475 0.085380 0.059063 0.068213 0.115492 0.118647 0.096290 0.151210 0.127796 0.135994 0.094536 0.080880 0.080265 0.121053 0.122145 0.136732 0.139938 0.157173 0.156970 0.107267 0.137379 0.107803 0.123916 0.122107 0.123117 0.121986
qa: -0.2339 -0.3170 -0.4554 -0.2732 -0.2900 -0.4909 -0.1307 -0.0191 -0.1326 0.0086 -0.1180 -0.1089 0.2042 0.3964 -0.2814 -0.1225 -0.2099 0.3355 -0.2528 -0.2817 0.1094 -0.1727 0.0889 -0.1265 -0.2281 -0.1373 -0.1725 -0.1502 0.4464 0.2356 -0.1478 -0.1304 0.0985 0.0909 0.0775 0.0854 0.0591 0.0682 0.1155 0.1186 0.0963 0.1512 0.1278 0.1360 0.0945 0.0809 0.0803 0.1211 0.1221 0.1367 0.1399 0.1572 0.1570 0.1073 0.1374 0.1078 0.1239 0.1221 0.1231 0.1220
va: 2.1875 2.0834 2.0612 2.1016 2.1297 2.0167 3.8243 3.3830 3.8607 3.6881 3.6127 3.8859 3.9884 4.3138 3.9515 3.8326 3.9277 3.7357 3.9725 3.9277 3.7328 3.7050 3.3602 3.8763 3.9925 3.4649 3.9210 3.9025 4.1493 3.9771 3.8701 3.8574 0.9980 1.0243 1.0077 1.0183 1.0087 1.0077 0.9915 0.9959 1.0074 0.9951 1.0317 1.0141 1.0048 0.9983 1.0005 0.9978 0.9935 1.0024 1.0099 0.9909 0.9913 1.0278 0.9969 0.9905 0.9945 0.9942 0.9856 0.9869
dispcorr: -0.036315030 hartree
energy: -1459.169789475196
dipole: 25.48658 -26.90025 -1.41366 -9.83925 7.75258 -2.08667 13.81067 -14.92702 -1.11635
magnitude: 2.75660 au
magnitude: 7.00673 debye
