program: Orca
programVersion: 5.0.4
elementType: O O O O O O C C C C C C C C C C C C C C C C C C C C C C C C C C H H H H H H H H H H H H H H H H H H H H H H H H H H H H
charge: 0
multiplicity: 1
keywords: wb97x-d3
keywords: def2-TZVPP
keywords: def2/J RIJCOSX
keywords: DEFGRID2
keywords: scfconv7
keywords: smallprint printgap noloewdin
keywords: NOSOSCF
formula: C26H28O6
InChI: InChI=1/C26H28O6/c1-5-6-10-21-17(2)20-13-12-19(14-24(20)32-26(21)28)31-15-18-9-7-8-11-22(18)23(16-29-3)25(27)30-4/h7-9,11-14,16H,5-6,10,15H2,1-4H3
60 atoms
O  1.976881 0.388285 -1.382115
O  -1.700912 -2.34945 -0.211403
O  3.568502 1.717081 -2.043593
O  -1.503067 1.459772 0.898851
O  -4.878438 -1.684789 0.366828
O  -2.506794 0.68158 2.733727
C  4.845693 1.931015 0.450953
C  3.58447 1.137838 0.255952
C  6.104003 1.192613 -0.020919
C  2.934642 0.435274 1.222324
C  1.742245 -0.309902 0.87897
C  6.425434 -0.064948 0.774793
C  1.304215 -0.305002 -0.439558
C  3.080615 1.123836 -1.109653
C  3.389492 0.375132 2.644238
C  0.979335 -1.049948 1.79434
C  0.174933 -0.986879 -0.868473
C  -0.570371 -1.685072 0.068017
C  -0.156243 -1.719478 1.406929
C  7.65005 -0.791373 0.238133
C  -2.327522 -2.172381 -1.465903
C  -2.745997 -0.759974 -1.804585
C  -3.16494 0.197217 -0.872588
C  -2.728089 -0.424883 -3.158325
C  -3.543658 1.460184 -1.334583
C  -3.238806 -0.048531 0.587151
C  -3.117711 0.825906 -3.60235
C  -3.526694 1.778702 -2.68041
C  -2.40491 0.712806 1.525341
C  -4.081439 -0.948341 1.121731
C  -0.657109 2.281695 1.6961
C  -5.697535 -2.632665 1.043652
H  4.762607 2.872572 -0.096355
H  4.964119 2.211521 1.497566
H  6.949143 1.884501 0.043487
H  6.004989 0.938394 -1.08019
H  6.585086 0.198382 1.825197
H  5.569508 -0.746107 0.758175
H  4.285363 0.956727 2.83322
H  2.609308 0.741169 3.314779
H  3.598583 -0.655851 2.936186
H  1.27312 -1.090251 2.83428
H  -0.096019 -0.938373 -1.913998
H  -0.742031 -2.270011 2.132035
H  7.503028 -1.101122 -0.798883
H  7.871726 -1.688584 0.818446
H  8.53779 -0.155765 0.266638
H  -1.684485 -2.558153 -2.264912
H  -3.202335 -2.823892 -1.433443
H  -2.389463 -1.161662 -3.878191
H  -3.871428 2.204093 -0.618315
H  -3.09134 1.057551 -4.659389
H  -3.828957 2.765022 -3.006126
H  -4.129874 -1.103673 2.196999
H  0.033354 2.759659 1.006697
H  -1.227684 3.051679 2.215485
H  -0.091105 1.704229 2.427032
H  -6.329504 -3.097675 0.291282
H  -5.092938 -3.402569 1.526035
H  -6.330794 -2.147514 1.788598
elementType: O C H
totalener: -1459.13356220 hartree
nucrepener: 3356.32628479 hartree
electener: -4815.45984699 hartree
oneelecener: -8664.34694339 hartree
twoeener: 3848.88709639 hartree
cpcmener: -0.04474308 hartree
kineticenergy: 1452.86290847 hartree
xcener: -140.277539071253 hartree
chargesum: 0.0000000
charge: -0.232545 -0.317435 -0.455337 -0.273908 -0.290285 -0.489687 -0.144474 0.006100 -0.131755 -0.035730 -0.101456 -0.081423 0.197691 0.399742 -0.278764 -0.118630 -0.206392 0.335624 -0.250133 -0.285671 0.109518 -0.173446 0.088462 -0.126410 -0.223487 -0.138397 -0.170728 -0.150625 0.444661 0.237153 -0.147397 -0.131036 0.096927 0.099184 0.076314 0.068055 0.058037 0.062044 0.098748 0.120969 0.118160 0.152111 0.125375 0.135026 0.080125 0.089694 0.079703 0.119560 0.122660 0.136605 0.139420 0.157273 0.155768 0.108064 0.124133 0.136631 0.108509 0.122299 0.122335 0.122469
qa: -0.2325 -0.3174 -0.4553 -0.2739 -0.2903 -0.4897 -0.1445 0.0061 -0.1318 -0.0357 -0.1015 -0.0814 0.1977 0.3997 -0.2788 -0.1186 -0.2064 0.3356 -0.2501 -0.2857 0.1095 -0.1734 0.0885 -0.1264 -0.2235 -0.1384 -0.1707 -0.1506 0.4447 0.2372 -0.1474 -0.1310 0.0969 0.0992 0.0763 0.0681 0.0580 0.0620 0.0987 0.1210 0.1182 0.1521 0.1254 0.1350 0.0801 0.0897 0.0797 0.1196 0.1227 0.1366 0.1394 0.1573 0.1558 0.1081 0.1241 0.1366 0.1085 0.1223 0.1223 0.1225
va: 2.1873 2.0838 2.0616 2.1001 2.1301 2.0190 3.8648 3.3143 3.8551 3.6521 3.5875 3.8509 4.0013 4.2967 3.9372 3.8200 3.9170 3.7379 3.9735 3.9596 3.7346 3.7079 3.3630 3.8747 3.9890 3.4651 3.9198 3.9030 4.1497 3.9688 3.8688 3.8579 1.0188 1.0044 1.0108 1.0187 1.0046 1.0021 1.0113 0.9961 0.9919 0.9940 1.0334 1.0143 1.0006 1.0028 1.0006 0.9983 0.9940 1.0026 1.0095 0.9908 0.9918 1.0275 0.9939 0.9969 0.9912 0.9943 0.9857 0.9864
dispcorr: -0.036293490 hartree
energy: -1459.169855694302
dipole: 26.66325 -28.16188 -1.49863 -1.27774 -0.40512 -1.68286 10.46848 -8.85927 1.60921
magnitude: 2.76902 au
magnitude: 7.03829 debye
