program: Orca
programVersion: 5.0.4
elementType: O O O O O O C C C C C C C C C C C C C C C C C C C C C C C C C C H H H H H H H H H H H H H H H H H H H H H H H H H H H H
charge: 0
multiplicity: 1
keywords: wb97x-d3
keywords: def2-TZVPP
keywords: def2/J RIJCOSX
keywords: DEFGRID2
keywords: scfconv7
keywords: smallprint printgap noloewdin
keywords: NOSOSCF
formula: C26H28O6
InChI: InChI=1/C26H28O6/c1-5-6-10-21-17(2)20-13-12-19(14-24(20)32-26(21)28)31-15-18-9-7-8-11-22(18)23(16-29-3)25(27)30-4/h7-9,11-14,16H,5-6,10,15H2,1-4H3
60 atoms
O  2.43772 0.618549 1.816396
O  -1.368707 1.487072 -0.86899
O  4.091497 0.134609 3.150091
O  -5.080567 -1.35641 1.413261
O  -2.367894 -1.012853 -2.337352
O  -3.756933 -3.089175 0.930449
C  6.107689 0.23539 1.16046
C  4.654849 0.486558 0.874802
C  6.490641 -1.238532 1.018417
C  4.147076 0.720286 -0.364261
C  2.725009 0.926491 -0.524051
C  7.965234 -1.487104 1.307517
C  1.909533 0.870648 0.600427
C  3.760973 0.397174 2.017353
C  4.995746 0.762397 -1.593114
C  2.095372 1.18324 -1.751629
C  0.533733 1.059179 0.5507
C  -0.057047 1.303405 -0.680299
C  0.738042 1.367938 -1.835919
C  8.369479 -2.940821 1.116714
C  -2.270147 1.342934 0.226291
C  -3.655687 1.367725 -0.345521
C  -4.330377 0.189568 -0.683765
C  -4.267746 2.596723 -0.578292
C  -5.606178 0.27481 -1.238302
C  -3.730237 -1.147059 -0.453676
C  -5.534315 2.67083 -1.134604
C  -6.206044 1.502482 -1.466943
C  -4.165553 -1.976144 0.675289
C  -2.792536 -1.661538 -1.26857
C  -5.609491 -2.060957 2.532868
C  -1.271929 -1.592914 -3.037851
H  6.729972 0.836987 0.495718
H  6.344862 0.573608 2.170692
H  6.253411 -1.576991 0.004339
H  5.876496 -1.84197 1.694101
H  8.573129 -0.851648 0.655777
H  8.190915 -1.174431 2.331612
H  4.6856 -0.01439 -2.295035
H  4.887724 1.718115 -2.10915
H  6.05126 0.614081 -1.387403
H  2.682815 1.236447 -2.658075
H  -0.03416 1.010396 1.470465
H  0.268595 1.561802 -2.791824
H  9.427529 -3.093477 1.335198
H  8.197141 -3.269853 0.089854
H  7.801137 -3.602932 1.772988
H  -2.08094 0.406861 0.758502
H  -2.130304 2.166791 0.93335
H  -3.744417 3.507809 -0.31219
H  -6.132105 -0.635875 -1.497529
H  -5.995972 3.634755 -1.305625
H  -7.196833 1.546588 -1.900536
H  -2.364597 -2.643392 -1.077581
H  -6.33893 -1.394853 2.986624
H  -6.108746 -2.981967 2.229752
H  -4.836422 -2.294623 3.265671
H  -0.372518 -1.609965 -2.420458
H  -1.504919 -2.608265 -3.364951
H  -1.09205 -0.972831 -3.912075
elementType: O C H
totalener: -1459.13866379 hartree
nucrepener: 3115.12763269 hartree
electener: -4574.26629648 hartree
oneelecener: -8181.09871918 hartree
twoeener: 3606.83242270 hartree
cpcmener: -0.04625486 hartree
kineticenergy: 1452.84440937 hartree
xcener: -140.262372635938 hartree
chargesum: -0.0000000
charge: -0.233777 -0.295790 -0.455410 -0.284906 -0.282891 -0.494135 -0.118986 -0.033208 -0.129590 0.016737 -0.063901 -0.091042 0.112731 0.395890 -0.293628 -0.076388 -0.172473 0.340844 -0.310874 -0.277011 0.047437 -0.102399 0.051244 -0.143021 -0.182071 -0.220186 -0.168915 -0.150029 0.502734 0.245800 -0.136230 -0.142555 0.094205 0.089562 0.071191 0.078814 0.056708 0.060466 0.117470 0.116158 0.099651 0.153365 0.128537 0.139937 0.089802 0.077609 0.078869 0.126522 0.131102 0.141424 0.142637 0.157516 0.157140 0.108236 0.122711 0.114831 0.114780 0.120185 0.131082 0.125488
qa: -0.2338 -0.2958 -0.4554 -0.2849 -0.2829 -0.4941 -0.1190 -0.0332 -0.1296 0.0167 -0.0639 -0.0910 0.1127 0.3959 -0.2936 -0.0764 -0.1725 0.3408 -0.3109 -0.2770 0.0474 -0.1024 0.0512 -0.1430 -0.1821 -0.2202 -0.1689 -0.1500 0.5027 0.2458 -0.1362 -0.1426 0.0942 0.0896 0.0712 0.0788 0.0567 0.0605 0.1175 0.1162 0.0997 0.1534 0.1285 0.1399 0.0898 0.0776 0.0789 0.1265 0.1311 0.1414 0.1426 0.1575 0.1571 0.1082 0.1227 0.1148 0.1148 0.1202 0.1311 0.1255
va: 2.1889 2.0825 2.0603 2.1099 2.1179 2.0256 3.8349 3.4165 3.8386 3.6998 3.7317 3.8689 4.1140 4.3057 3.9517 3.8454 3.9054 3.7752 4.0323 3.9471 3.7510 3.8195 3.5019 3.9201 3.9614 3.4152 3.9110 3.9059 4.1261 3.9751 3.8817 3.8584 1.0012 1.0243 1.0085 1.0168 1.0077 1.0080 0.9918 0.9954 1.0068 0.9949 1.0283 1.0140 1.0042 1.0009 1.0011 0.9874 0.9896 1.0035 1.0061 0.9911 0.9908 1.0270 0.9962 0.9926 0.9927 0.9826 0.9883 0.9919
dispcorr: -0.029641437 hartree
energy: -1459.168305229722
dipole: 33.74313 -33.95767 -0.21455 -10.98687 11.62883 0.64196 -4.61181 1.64000 -2.97181
magnitude: 3.04792 au
magnitude: 7.74719 debye
