program: Orca
programVersion: 5.0.4
elementType: O O O O O O C C C C C C C C C C C C C C C C C C C C C C C C C C H H H H H H H H H H H H H H H H H H H H H H H H H H H H
charge: 0
multiplicity: 1
keywords: wb97x-d3
keywords: def2-TZVPP
keywords: def2/J RIJCOSX
keywords: DEFGRID2
keywords: scfconv7
keywords: smallprint printgap noloewdin
keywords: NOSOSCF
formula: C26H28O6
InChI: InChI=1/C26H28O6/c1-5-6-10-21-17(2)20-13-12-19(14-24(20)32-26(21)28)31-15-18-9-7-8-11-22(18)23(16-29-3)25(27)30-4/h7-9,11-14,16H,5-6,10,15H2,1-4H3
60 atoms
O  1.709044 -0.559928 -0.304161
O  -1.689618 2.286824 1.355199
O  3.149735 -1.974774 -1.113896
O  -5.042394 -0.716208 1.134792
O  -1.309918 -2.143026 -1.230343
O  -4.118736 -2.662831 1.722418
C  5.386122 -0.195558 -0.972181
C  3.988834 0.178134 -0.559567
C  6.291914 -0.588921 0.198914
C  3.648991 1.401715 -0.070468
C  2.28005 1.664594 0.312575
C  5.859648 -1.845268 0.944069
C  1.343954 0.646542 0.176994
C  2.974867 -0.855812 -0.68703
C  4.637858 2.508734 0.098158
C  1.813988 2.887577 0.819746
C  0.00629 0.795877 0.511153
C  -0.423782 2.01982 0.998763
C  0.493646 3.069698 1.153065
C  6.831959 -2.219452 2.052884
C  -2.693367 1.301689 1.150948
C  -3.037794 1.122319 -0.307529
C  -3.276937 -0.141396 -0.861249
C  -3.138047 2.251565 -1.116808
C  -3.593749 -0.237291 -2.216701
C  -3.17987 -1.385428 -0.060755
C  -3.451818 2.1421 -2.461745
C  -3.677945 0.890454 -3.016041
C  -4.133531 -1.678372 1.014339
C  -2.22876 -2.310244 -0.297749
C  -6.001446 -0.840796 2.180447
C  -0.34581 -3.184329 -1.374101
H  5.349279 -1.01742 -1.688381
H  5.84313 0.638262 -1.507956
H  6.355926 0.245957 0.904665
H  7.304215 -0.735347 -0.190806
H  4.863486 -1.702786 1.373105
H  5.774519 -2.676807 0.238658
H  4.312243 3.402869 -0.436477
H  4.728456 2.78315 1.151085
H  5.629959 2.253082 -0.260072
H  2.499215 3.71376 0.952439
H  -0.655327 -0.047385 0.380453
H  0.153685 4.022363 1.538389
H  6.514337 -3.123349 2.574968
H  6.913974 -1.42398 2.796619
H  7.833466 -2.404479 1.658738
H  -2.397168 0.359986 1.620851
H  -3.558017 1.675709 1.700937
H  -2.96364 3.233926 -0.695037
H  -3.78298 -1.212912 -2.647268
H  -3.521832 3.032305 -3.073521
H  -3.922894 0.792228 -4.065806
H  -2.18306 -3.225273 0.288995
H  -6.631712 0.042062 2.113119
H  -6.620005 -1.730371 2.057091
H  -5.525141 -0.86531 3.161323
H  0.193771 -3.357654 -0.442306
H  -0.821917 -4.11194 -1.696415
H  0.354901 -2.861247 -2.139116
elementType: O C H
totalener: -1459.13853224 hartree
nucrepener: 3257.30863877 hartree
electener: -4716.44717101 hartree
oneelecener: -8466.02885720 hartree
twoeener: 3749.58168619 hartree
cpcmener: -0.03984622 hartree
kineticenergy: 1452.82782146 hartree
xcener: -140.266814884806 hartree
chargesum: 0.0000000
charge: -0.243407 -0.321672 -0.471933 -0.282603 -0.285680 -0.490451 -0.125343 0.016630 -0.145011 0.014113 -0.053638 -0.074187 0.100709 0.374926 -0.300709 -0.097448 -0.121678 0.295222 -0.263089 -0.283255 0.085130 -0.139896 0.062304 -0.152124 -0.210238 -0.167672 -0.163773 -0.156176 0.490546 0.253169 -0.139573 -0.145533 0.093223 0.099282 0.071696 0.075338 0.057919 0.058376 0.115406 0.121063 0.096645 0.153973 0.119629 0.136674 0.091176 0.078048 0.079094 0.128345 0.124477 0.138401 0.142978 0.157020 0.156065 0.110328 0.123822 0.120409 0.116887 0.119250 0.135149 0.121667
qa: -0.2434 -0.3217 -0.4719 -0.2826 -0.2857 -0.4905 -0.1253 0.0166 -0.1450 0.0141 -0.0536 -0.0742 0.1007 0.3749 -0.3007 -0.0974 -0.1217 0.2952 -0.2631 -0.2833 0.0851 -0.1399 0.0623 -0.1521 -0.2102 -0.1677 -0.1638 -0.1562 0.4905 0.2532 -0.1396 -0.1455 0.0932 0.0993 0.0717 0.0753 0.0579 0.0584 0.1154 0.1211 0.0966 0.1540 0.1196 0.1367 0.0912 0.0780 0.0791 0.1283 0.1245 0.1384 0.1430 0.1570 0.1561 0.1103 0.1238 0.1204 0.1169 0.1192 0.1351 0.1217
va: 2.2095 2.0889 2.0379 2.1202 2.1170 2.0279 3.8475 3.4465 3.8803 3.7014 3.7726 3.8497 4.1541 4.2178 3.9455 3.8903 3.8075 3.8116 4.0575 3.9559 3.7957 3.6425 3.4746 3.9053 3.9756 3.4489 3.9133 3.9040 4.1271 3.9231 3.8735 3.8487 1.0264 1.0008 1.0028 1.0107 1.0079 1.0111 0.9959 0.9909 1.0094 0.9935 1.0241 1.0151 1.0029 1.0008 1.0011 0.9960 0.9920 1.0137 1.0071 0.9909 0.9916 1.0303 0.9956 0.9941 0.9929 0.9906 0.9888 0.9990
dispcorr: -0.032798445 hartree
energy: -1459.171330685659
dipole: 30.43219 -30.03608 0.39611 -3.64958 5.69940 2.04982 5.21830 -5.01109 0.20721
magnitude: 2.09800 au
magnitude: 5.33269 debye
