program: Gaussian 09
title: 000074337
version: EM64L-G09RevD.01
frameworkgroup: C1[X(C14H12O2S)]
method: RPBEPBE
basis: SDD
operation: Freq
keyword: #p
keyword: freq=noraman
keyword: PBEPBE/SDD
title: #p freq=noraman PBEPBE/SDD
converged: YES YES NO NO
title: Mulliken charges:
elementType: S O O C C C C C C C C C C C C C C H H H H H H H H H H H H
charge: 0.176394 -0.447092 -0.253252 0.460426 -0.895417 0.115301 -0.333444 -0.346070 -0.181316 -0.232343 -0.234177 0.111158 -0.246267 -0.241326 -0.222506 -0.202176 -0.229500 0.345703 0.270970 0.239438 0.276540 0.233680 0.237528 0.254055 0.263598 0.230119 0.232278 0.231400 0.386298
chargesum: 0.00000
title: Mulliken charges with hydrogens summed into heavy atoms:
elementType: S O O C C C C C C C C C C C C C C
charge: 0.176394 -0.060793 -0.253252 0.460426 -0.278744 0.115301 -0.094006 -0.069531 -0.181316 0.001337 0.003351 0.111158 0.007788 0.022273 0.007613 0.030102 0.001900
polarizability: 2.08877055e+02 2.05916492e+01 1.72115019e+02 -2.99755054e+01 1.75337949e+01 1.24048781e+02
1716.lowfreq: -26.4244 -7.9169 -4.3041 -0.0017 -0.0005 0.0008 10.8697 29.2297 38.9453
frequency: -14.7176 29.0076 38.9147 57.8504 76.6358 91.6844 135.7175 209.4693 236.7198 263.8520 298.6091 344.7058 362.2112 388.2273 406.3701 416.1179 473.0678 489.2282 514.1033 561.4004 579.8530 604.6807 609.3506 613.1946 676.9175 693.4276 697.0313 707.7579 755.0027 772.1102 788.4375 822.2249 853.9726 896.0181 898.8460 931.8161 978.4865 981.6717 986.0807 998.6887 1003.2050 1007.9874 1014.3920 1056.4575 1068.2102 1070.8807 1082.7626 1159.2591 1167.4706 1170.8976 1179.7312 1180.8494 1210.7256 1238.8887 1289.9908 1295.7673 1315.6829 1370.5033 1384.2945 1423.1403 1433.8989 1450.3022 1456.5400 1478.1105 1572.1792 1583.0762 1585.6290 1606.6912 1627.8595 3048.9315 3126.7322 3126.9121 3137.7608 3141.6100 3150.6877 3155.4249 3158.6480 3163.9214 3170.3481 3170.9236 3515.0268
redmass: 5.9572 5.6083 4.6523 8.3923 5.7024 5.4115 4.9772 4.9198 5.9818 5.4122 6.0657 2.7232 7.0755 8.9869 2.8390 3.1038 3.9972 3.2320 4.7594 5.1915 1.3533 4.7113 6.4553 4.6569 6.7337 3.5192 2.2411 4.8004 1.4823 2.5243 1.7913 4.7260 1.2441 1.4708 1.6810 1.4029 1.3871 1.3877 6.3377 1.3173 1.3650 5.0537 3.2973 2.1930 1.6268 2.3778 2.1121 1.2330 1.4691 1.0574 1.1136 1.0650 2.5894 1.1878 1.5035 1.3314 2.3888 9.4876 7.5030 2.0626 2.2231 1.2338 1.8499 2.4641 6.6886 6.1954 6.0614 6.1829 7.9644 1.0649 1.0867 1.0851 1.0884 1.0896 1.0928 1.0941 1.0968 1.1000 1.1012 1.1002 1.0638
irintensity: 0.5869 0.2677 0.1611 0.8408 0.8698 1.7580 2.3883 1.4758 0.8746 0.8330 2.3542 3.9469 7.5392 0.6537 0.0670 10.5224 4.4481 14.9195 5.3820 2.9361 87.3270 26.9830 0.6741 20.5044 3.5629 114.8308 23.9322 10.7282 59.9946 28.9410 27.5181 3.6262 0.9710 0.6908 3.1188 3.1869 2.8771 1.2601 3.6519 0.2427 1.7890 137.4300 17.1802 19.5856 6.3899 0.9727 24.0761 31.4832 50.2270 0.5202 2.1760 2.0509 14.7068 2.4049 2.0782 0.5153 55.8704 0.3984 16.0386 8.5190 20.7166 3.9222 33.1036 6.8206 4.7486 1.3779 4.2738 72.3043 167.6430 15.4007 3.8681 1.0781 4.9591 10.4523 16.0997 11.0157 24.0618 3.7933 14.6334 20.7382 33.9364
temp: 298.150 k
press: 1.00000 atm
elementType: 16 8 8 6 6 6 6 6 6 6 6 6 6 6 6 6 6 1 1 1 1 1 1 1 1 1 1 1 1
symmnumber: 1
zpe: 578943.4 jmol-1
zpe.correction: 0.220508 hartree
zpe.thermalcorrener: 0.234792 hartree
zpe.thermalcorrenthalpy: 0.235736 hartree
zpe.thermalcorrgfe: 0.177725 hartree
zpe.sumelectzpe: -1088.006998 hartree
zpe.sumelectthermal: -1087.992714 hartree
zpe.sumelectthermalent: -1087.991770 hartree
zpe.sumelectthermalfe: -1088.049781 hartree
dipole: 0.5594 -0.0519 0.5184
dipole: 0.7645
quadrupole: -90.5457 -112.0113 -100.8556
quadrupole: 7.7119 -8.4265 3.8139
quadrupole: 10.5918 -10.8738 0.2819 7.7119 -8.4265 3.8139
hfenergy: -1088.2275062 hartree
pointgroup: C01 [X(C14H12O2S1)]
dipole: -0.2270614 0.0380355 -0.1935248 debye
polarizability: 200.457417|-20.0922971|180.8951582|-37.7264508|-4.5972784|123.6882801 unknown
InChI: InChI=1S/C14H12O2S/c15-14(16)13-9-5-4-6-11(13)10-17-12-7-2-1-3-8-12/h1-9,15H,10H2
charge 0 multiplicity 1
29 atoms
S  1.089479 2.52015 0.142999
O  0.198702 -0.507768 -2.356943
O  -0.469489 -2.379688 -1.186876
C  -1.375944 1.191798 -0.492484
C  -0.294864 2.039711 -1.120416
C  -1.460169 -0.236339 -0.576472
C  -2.355423 1.86677 0.287368
C  -2.490197 -0.924986 0.128353
C  2.037275 0.937488 0.222839
C  -3.381255 1.179953 0.963581
C  -3.446931 -0.232103 0.888932
C  -0.552998 -1.137158 -1.352746
C  3.143855 0.741626 -0.637848
C  1.67896 -0.059276 1.16129
C  3.887027 -0.459236 -0.564981
C  2.420859 -1.262276 1.225304
C  3.523168 -1.464394 0.36311
H  0.20545 1.557539 -1.966414
H  -0.686702 3.025932 -1.420173
H  -2.291237 2.958178 0.368855
H  -2.514214 -2.016958 0.055618
H  -4.121196 1.737889 1.547996
H  -4.235384 -0.781126 1.414089
H  3.417085 1.525753 -1.351652
H  0.829623 0.10873 1.831029
H  4.748117 -0.607063 -1.22659
H  2.134345 -2.037891 1.943603
H  4.096724 -2.396525 0.415997
H  0.782834 -1.193632 -2.780667
