program: Orca
programVersion: 5.0.4
elementType: O O O O O O C C C C C C C C C C C C C C C C C C C C C C C C C C H H H H H H H H H H H H H H H H H H H H H H H H H H H H
charge: 0
multiplicity: 1
keywords: wb97x-d3
keywords: def2-TZVPP
keywords: def2/J RIJCOSX
keywords: DEFGRID2
keywords: scfconv7
keywords: smallprint printgap noloewdin
keywords: NOSOSCF
formula: C26H28O6
InChI: InChI=1/C26H28O6/c1-5-6-10-21-17(2)20-13-12-19(14-24(20)32-26(21)28)31-15-18-9-7-8-11-22(18)23(16-29-3)25(27)30-4/h7-9,11-14,16H,5-6,10,15H2,1-4H3
60 atoms
O  1.606434 -0.623328 -0.200244
O  -1.761111 2.392937 1.188181
O  3.060445 -2.145391 -0.781729
O  -5.119992 -0.575349 1.14333
O  -1.482142 -2.200714 -1.265936
O  -4.259094 -2.557416 1.712254
C  5.338932 -0.516295 -0.449317
C  3.943311 -0.023447 -0.200632
C  5.953104 -1.155018 0.798795
C  3.629167 1.215116 0.25492
C  2.244767 1.562519 0.488477
C  7.338245 -1.748469 0.5664
C  1.269374 0.601977 0.244057
C  2.889211 -1.011186 -0.420566
C  4.662861 2.258589 0.544341
C  1.799867 2.807729 0.954669
C  -0.083405 0.831941 0.442296
C  -0.488482 2.067956 0.9200
C  0.467507 3.063045 1.168813
C  8.395425 -0.723332 0.178298
C  -2.769722 1.41193 1.019226
C  -3.122117 1.178305 -0.428336
C  -3.38184 -0.102001 -0.926823
C  -3.207888 2.275252 -1.279833
C  -3.711461 -0.244793 -2.27371
C  -3.295064 -1.317223 -0.083042
C  -3.536006 2.11837 -2.614955
C  -3.787728 0.850271 -3.115352
C  -4.246571 -1.577348 1.00928
C  -2.385274 -2.284626 -0.309901
C  -6.088245 -0.70906 2.170938
C  -0.537554 -3.252621 -1.410682
H  5.32013 -1.255003 -1.252405
H  5.966775 0.300509 -0.807185
H  5.282461 -1.940987 1.153854
H  6.003118 -0.410434 1.600602
H  7.654634 -2.260279 1.47865
H  7.274352 -2.521548 -0.204881
H  5.675988 1.910095 0.370335
H  4.50381 3.144052 -0.073917
H  4.6020 2.578842 1.585886
H  2.515784 3.592069 1.159408
H  -0.777734 0.040838 0.201892
H  0.143001 4.026443 1.537875
H  8.186676 -0.262935 -0.788092
H  9.381927 -1.181546 0.10682
H  8.459662 0.077225 0.918171
H  -2.478216 0.481707 1.516255
H  -3.633503 1.805857 1.556113
H  -3.004802 3.266722 -0.895268
H  -3.915146 -1.234472 -2.661356
H  -3.595332 2.983898 -3.261569
H  -4.043982 0.713992 -4.157701
H  -2.379041 -3.177375 0.313213
H  -5.626288 -0.766825 3.157436
H  -6.710002 0.180567 2.113539
H  -6.70922 -1.593832 2.027978
H  -0.818839 -4.130235 -0.824326
H  -0.502768 -3.53103 -2.462496
H  0.447754 -2.911605 -1.099412
totalener: -1459.10996054 hartree
nucrepener: 3225.26840309 hartree
electener: -4684.37836363 hartree
oneelecener: -8400.86757236 hartree
twoeener: 3716.48920872 hartree
kineticenergy: 1452.90663234 hartree
xcener: -140.274354700931 hartree
chargesum: -0.0000000
charge: -0.237874 -0.293404 -0.377965 -0.272596 -0.250367 -0.392930 -0.126657 0.049461 -0.126299 -0.019455 -0.021480 -0.109462 0.040081 0.315017 -0.305811 -0.076302 -0.048359 0.291902 -0.241101 -0.266953 0.057566 -0.116723 0.122770 -0.121899 -0.179792 -0.263822 -0.132566 -0.120410 0.432153 0.247094 -0.143386 -0.087108 0.099383 0.081823 0.092137 0.067714 0.067240 0.061822 0.088536 0.109760 0.106828 0.124780 0.072895 0.115793 0.074839 0.090074 0.074403 0.112940 0.112125 0.117510 0.113439 0.123963 0.122847 0.103589 0.109747 0.113716 0.114634 0.081976 0.102688 0.119476
qa: -0.2379 -0.2934 -0.3780 -0.2726 -0.2504 -0.3929 -0.1267 0.0495 -0.1263 -0.0195 -0.0215 -0.1095 0.0401 0.3150 -0.3058 -0.0763 -0.0484 0.2919 -0.2411 -0.2670 0.0576 -0.1167 0.1228 -0.1219 -0.1798 -0.2638 -0.1326 -0.1204 0.4322 0.2471 -0.1434 -0.0871 0.0994 0.0818 0.0921 0.0677 0.0672 0.0618 0.0885 0.1098 0.1068 0.1248 0.0729 0.1158 0.0748 0.0901 0.0744 0.1129 0.1121 0.1175 0.1134 0.1240 0.1228 0.1036 0.1097 0.1137 0.1146 0.0820 0.1027 0.1195
va: 2.2246 2.1170 2.1367 2.1142 2.1481 2.1258 3.8262 3.4993 3.8625 3.7106 3.7781 3.8843 4.2690 4.2746 3.9459 3.9199 3.8216 3.8685 4.1102 3.9290 3.8315 3.6847 3.5139 3.9440 4.0346 3.6018 3.9707 3.9561 4.1521 3.9199 3.9043 3.8617 1.0262 1.0004 1.0212 1.0094 1.0086 1.0098 1.0132 0.9953 0.9931 1.0019 1.0463 1.0219 1.0005 1.0079 1.0021 0.9997 0.9915 1.0202 1.0139 1.0010 1.0012 1.0365 0.9942 0.9939 0.9973 1.0003 0.9915 1.0025
dispcorr: -0.032063719 hartree
energy: -1459.142024261963
dipole: 34.93671 -34.60626 0.33045 -1.88529 3.01892 1.13363 2.31410 -2.29346 0.02064
magnitude: 1.18099 au
magnitude: 3.00184 debye
