program: Orca
programVersion: 5.0.4
elementType: O O O O O O C C C C C C C C C C C C C C C C C C C C C C C C C C H H H H H H H H H H H H H H H H H H H H H H H H H H H H
charge: 0
multiplicity: 1
keywords: wb97x-d3
keywords: def2-TZVPP
keywords: def2/J RIJCOSX
keywords: DEFGRID2
keywords: scfconv7
keywords: smallprint printgap noloewdin
keywords: NOSOSCF
formula: C26H28O6
InChI: InChI=1/C26H28O6/c1-5-6-10-21-17(2)20-13-12-19(14-24(20)32-26(21)28)31-15-18-9-7-8-11-22(18)23(16-29-3)25(27)30-4/h7-9,11-14,16H,5-6,10,15H2,1-4H3
60 atoms
O  1.632743 -0.60526 -0.303903
O  -1.742866 2.336034 1.227086
O  3.088503 -2.076088 -1.004122
O  -5.299112 -0.530743 1.005332
O  -1.440329 -2.193558 -0.993398
O  -4.579589 -2.556137 1.617927
C  5.363008 -0.45337 -0.594158
C  3.966895 0.007273 -0.290585
C  6.009447 -1.160667 0.599149
C  3.652592 1.209312 0.253726
C  2.268441 1.536343 0.516482
C  7.409897 -1.692106 0.31258
C  1.29446 0.592203 0.2112
C  2.915538 -0.970276 -0.565778
C  4.685496 2.233709 0.606544
C  1.82212 2.750627 1.057223
C  -0.059642 0.812543 0.414684
C  -0.46691 2.019562 0.959795
C  0.488742 2.994755 1.278482
C  8.438716 -0.605531 0.029199
C  -2.750856 1.362493 1.023143
C  -3.076345 1.141449 -0.432314
C  -3.391186 -0.129856 -0.920518
C  -3.077629 2.227398 -1.301114
C  -3.686341 -0.279937 -2.273374
C  -3.39727 -1.332319 -0.053063
C  -3.375341 2.06474 -2.643151
C  -3.678816 0.804187 -3.133183
C  -4.460683 -1.567872 0.93751
C  -2.456144 -2.287885 -0.152513
C  -6.375283 -0.641546 1.922971
C  -0.460668 -3.220448 -0.933427
H  5.336516 -1.141422 -1.440654
H  5.97374 0.391964 -0.914001
H  5.365626 -1.989741 0.902063
H  6.046911 -0.474852 1.452436
H  7.741103 -2.280395 1.171917
H  7.367093 -2.388862 -0.529618
H  5.699267 1.894929 0.417672
H  4.529632 3.153111 0.038991
H  4.620541 2.494287 1.664244
H  2.537908 3.519714 1.313759
H  -0.752143 0.04096 0.115084
H  0.162907 3.934245 1.7038
H  8.21457 -0.053458 -0.884329
H  9.436488 -1.027957 -0.090344
H  8.485112 0.115879 0.847533
H  -2.473929 0.422567 1.511575
H  -3.624707 1.751561 1.547672
H  -2.830651 3.212501 -0.926228
H  -3.926508 -1.265661 -2.650298
H  -3.368202 2.921126 -3.304455
H  -3.907946 0.66501 -4.181362
H  -2.506797 -3.169697 0.483926
H  -6.022891 -0.739701 2.950485
H  -6.949079 0.275922 1.822607
H  -7.014144 -1.494745 1.693748
H  0.35542 -2.925114 -1.584309
H  -0.064434 -3.335278 0.076792
H  -0.87339 -4.173004 -1.272254
totalener: -1459.11033516 hartree
nucrepener: 3224.51091336 hartree
electener: -4683.62124852 hartree
oneelecener: -8399.33262774 hartree
twoeener: 3715.71137922 hartree
kineticenergy: 1452.91162451 hartree
xcener: -140.273474513959 hartree
chargesum: 0.0000000
charge: -0.231161 -0.295060 -0.371367 -0.271519 -0.259785 -0.390556 -0.128280 0.039003 -0.128773 -0.019317 -0.017603 -0.107452 0.023539 0.316397 -0.305439 -0.080744 -0.047786 0.287237 -0.237936 -0.266672 0.062180 -0.111748 0.112579 -0.120976 -0.167515 -0.264108 -0.127512 -0.124617 0.441394 0.240153 -0.143712 -0.144216 0.099251 0.082281 0.092172 0.067899 0.067206 0.060864 0.087439 0.110349 0.106372 0.124719 0.080982 0.116424 0.073818 0.090631 0.074540 0.111186 0.112422 0.118508 0.114404 0.124097 0.123377 0.110702 0.109450 0.113836 0.114212 0.129475 0.107180 0.117580
qa: -0.2312 -0.2951 -0.3714 -0.2715 -0.2598 -0.3906 -0.1283 0.0390 -0.1288 -0.0193 -0.0176 -0.1075 0.0235 0.3164 -0.3054 -0.0807 -0.0478 0.2872 -0.2379 -0.2667 0.0622 -0.1117 0.1126 -0.1210 -0.1675 -0.2641 -0.1275 -0.1246 0.4414 0.2402 -0.1437 -0.1442 0.0993 0.0823 0.0922 0.0679 0.0672 0.0609 0.0874 0.1103 0.1064 0.1247 0.0810 0.1164 0.0738 0.0906 0.0745 0.1112 0.1124 0.1185 0.1144 0.1241 0.1234 0.1107 0.1095 0.1138 0.1142 0.1295 0.1072 0.1176
va: 2.2270 2.1166 2.1437 2.1132 2.1256 2.1276 3.8306 3.4913 3.8628 3.7106 3.7906 3.8840 4.2819 4.2862 3.9472 3.9227 3.8008 3.8655 4.1140 3.9291 3.8264 3.6973 3.5162 3.9385 4.0371 3.6104 3.9664 3.9605 4.1559 3.9218 3.9060 3.8614 1.0269 1.0003 1.0213 1.0093 1.0084 1.0099 1.0132 0.9952 0.9932 1.0019 1.0510 1.0217 1.0011 1.0078 1.0022 1.0012 0.9911 1.0202 1.0132 1.0009 1.0012 1.0317 0.9941 0.9941 0.9967 1.0089 0.9919 0.9866
dispcorr: -0.032354879 hartree
energy: -1459.142690036082
dipole: 35.37071 -35.01289 0.35782 -1.48769 2.64693 1.15925 2.52485 -2.29256 0.23229
magnitude: 1.23525 au
magnitude: 3.13976 debye
