program: Orca
programVersion: 5.0.4
elementType: O O O O O O C C C C C C C C C C C C C C C C C C C C C C C C C C H H H H H H H H H H H H H H H H H H H H H H H H H H H H
charge: 0
multiplicity: 1
keywords: wb97x-d3
keywords: def2-TZVPP
keywords: def2/J RIJCOSX
keywords: DEFGRID2
keywords: scfconv7
keywords: smallprint printgap noloewdin
keywords: NOSOSCF
formula: C26H28O6
InChI: InChI=1/C26H28O6/c1-5-6-10-21-17(2)20-13-12-19(14-24(20)32-26(21)28)31-15-18-9-7-8-11-22(18)23(16-29-3)25(27)30-4/h7-9,11-14,16H,5-6,10,15H2,1-4H3
60 atoms
O  1.70728 -0.858493 0.486318
O  -1.678738 2.363366 1.21372
O  3.161522 -2.432069 0.068976
O  -5.315341 -0.365306 0.648713
O  -1.278852 -2.412427 -0.425249
O  -4.817752 -2.299622 1.652384
C  5.444406 -0.842049 0.409473
C  4.055703 -0.302499 0.603919
C  5.862332 -0.91763 -1.063735
C  3.739353 0.975139 0.936292
C  2.348667 1.363705 1.041535
C  5.954513 0.436162 -1.756139
C  1.37008 0.407583 0.794607
C  2.992368 -1.278793 0.364284
C  4.763331 2.037405 1.190032
C  1.900668 2.655531 1.353371
C  0.012662 0.686778 0.839122
C  -0.396461 1.974408 1.144249
C  0.562822 2.962372 1.406993
C  6.378058 0.319364 -3.213313
C  -2.69851 1.418725 0.942206
C  -2.777033 1.038347 -0.515216
C  -3.073723 -0.268441 -0.911526
C  -2.559252 2.013455 -1.482895
C  -3.132772 -0.565576 -2.270919
C  -3.303956 -1.359001 0.065617
C  -2.621287 1.704911 -2.830708
C  -2.907915 0.408227 -3.227811
C  -4.531873 -1.422531 0.876093
C  -2.428463 -2.367487 0.225881
C  -6.550925 -0.325654 1.344944
C  -0.442171 -3.535263 -0.190154
H  6.170794 -0.243602 0.960642
H  5.494895 -1.844121 0.837567
H  5.164495 -1.562711 -1.603365
H  6.8347 -1.416466 -1.117707
H  4.988365 0.945785 -1.70122
H  6.665974 1.073594 -1.220991
H  5.781715 1.672141 1.116729
H  4.656915 2.850792 0.469913
H  4.634899 2.467499 2.184776
H  2.617959 3.439244 1.554888
H  -0.677196 -0.108073 0.601923
H  0.23658 3.965077 1.647518
H  6.434413 1.296248 -3.69383
H  5.670227 -0.286169 -3.78139
H  7.358331 -0.150761 -3.306193
H  -2.575212 0.533865 1.575261
H  -3.621772 1.909056 1.253813
H  -2.325252 3.026037 -1.179776
H  -3.361294 -1.57861 -2.575815
H  -2.444314 2.475971 -3.568863
H  -2.955172 0.155039 -4.278653
H  -2.64548 -3.170887 0.927892
H  -7.1763 -1.18593 1.104717
H  -6.40751 -0.29437 2.425659
H  -7.048473 0.583861 1.018639
H  -0.34464 -3.74517 0.87708
H  -0.830792 -4.420952 -0.696903
H  0.541291 -3.293602 -0.581128
totalener: -1459.11030627 hartree
nucrepener: 3261.12332863 hartree
electener: -4720.23363490 hartree
oneelecener: -8472.59432887 hartree
twoeener: 3752.36069397 hartree
kineticenergy: 1452.90833979 hartree
xcener: -140.274123399958 hartree
chargesum: 0.0000000
charge: -0.229465 -0.293648 -0.375951 -0.270392 -0.255489 -0.390226 -0.138040 0.061436 -0.130549 -0.072302 0.007186 -0.089566 0.028667 0.320593 -0.302576 -0.072230 -0.043369 0.278152 -0.234789 -0.260281 0.059751 -0.123309 0.120158 -0.116661 -0.169583 -0.267736 -0.128288 -0.124967 0.438108 0.249536 -0.144200 -0.136738 0.088344 0.101937 0.082349 0.068290 0.061543 0.049023 0.089259 0.109595 0.113613 0.124998 0.074500 0.116092 0.083255 0.077726 0.073787 0.112064 0.112262 0.118285 0.113167 0.123722 0.123317 0.105897 0.113695 0.109442 0.114556 0.098327 0.116116 0.131607
qa: -0.2295 -0.2936 -0.3760 -0.2704 -0.2555 -0.3902 -0.1380 0.0614 -0.1305 -0.0723 0.0072 -0.0896 0.0287 0.3206 -0.3026 -0.0722 -0.0434 0.2782 -0.2348 -0.2603 0.0598 -0.1233 0.1202 -0.1167 -0.1696 -0.2677 -0.1283 -0.1250 0.4381 0.2495 -0.1442 -0.1367 0.0883 0.1019 0.0823 0.0683 0.0615 0.0490 0.0893 0.1096 0.1136 0.1250 0.0745 0.1161 0.0833 0.0777 0.0738 0.1121 0.1123 0.1183 0.1132 0.1237 0.1233 0.1059 0.1137 0.1094 0.1146 0.0983 0.1161 0.1316
va: 2.2282 2.1174 2.1381 2.1142 2.1303 2.1283 3.8665 3.4231 3.8568 3.6707 3.7604 3.8660 4.2809 4.2700 3.9341 3.9123 3.7917 3.8718 4.1069 3.9686 3.8247 3.6979 3.5097 3.9354 4.0392 3.6050 3.9669 3.9605 4.1561 3.9160 3.9062 3.8609 1.0023 1.0222 1.0188 1.0124 1.0009 1.0035 1.0187 0.9915 0.9975 1.0013 1.0504 1.0217 1.0048 1.0036 1.0033 0.9987 0.9912 1.0194 1.0136 1.0009 1.0013 1.0341 0.9965 0.9943 0.9939 0.9921 0.9871 1.0117
dispcorr: -0.032881380 hartree
energy: -1459.143187650222
dipole: 29.10240 -28.78334 0.31906 3.19099 -2.01591 1.17508 -10.05155 9.97623 -0.07533
magnitude: 1.21996 au
magnitude: 3.10088 debye
