program: Orca
programVersion: 5.0.4
elementType: O O O O O O C C C C C C C C C C C C C C C C C C C C C C C C C C H H H H H H H H H H H H H H H H H H H H H H H H H H H H
charge: 0
multiplicity: 1
keywords: wb97x-d3
keywords: def2-TZVPP
keywords: def2/J RIJCOSX
keywords: DEFGRID2
keywords: scfconv7
keywords: smallprint printgap noloewdin
keywords: NOSOSCF
formula: C26H28O6
InChI: InChI=1/C26H28O6/c1-5-6-10-21-17(2)20-13-12-19(14-24(20)32-26(21)28)31-15-18-9-7-8-11-22(18)23(16-29-3)25(27)30-4/h7-9,11-14,16H,5-6,10,15H2,1-4H3
60 atoms
O  1.630692 -0.921318 -0.075295
O  -1.412143 2.433556 -1.445481
O  2.912481 -2.539063 0.634847
O  -1.722738 -2.316452 0.20044
O  -5.289366 0.052837 -1.609766
O  -2.990703 -3.32848 -1.338299
C  5.310555 -1.094787 0.565647
C  4.002413 -0.493775 0.135022
C  5.460415 -1.176093 2.091391
C  3.815829 0.772322 -0.31699
C  2.47952 1.227165 -0.640278
C  5.576923 0.171004 2.798126
C  1.419403 0.340448 -0.492171
C  2.857225 -1.39898 0.261319
C  4.928389 1.756981 -0.498815
C  2.160642 2.522045 -1.073654
C  0.101058 0.68757 -0.74909
C  -0.179575 1.976894 -1.170571
C  0.865376 2.896857 -1.334506
C  6.912634 0.86938 2.580984
C  -2.512427 1.551241 -1.336484
C  -2.843257 1.185847 0.088881
C  -3.315409 -0.0858 0.424287
C  -2.668607 2.136136 1.091364
C  -3.579664 -0.378292 1.761353
C  -3.555644 -1.134916 -0.593281
C  -2.939683 1.834019 2.413188
C  -3.393726 0.567747 2.75179
C  -2.758207 -2.380605 -0.63084
C  -4.520548 -1.027125 -1.518286
C  -0.830114 -3.426107 0.215964
C  -6.269056 0.045443 -2.628373
H  5.380536 -2.106012 0.161303
H  6.149665 -0.546583 0.137565
H  6.346025 -1.777631 2.31777
H  4.613094 -1.732189 2.495179
H  4.756009 0.825419 2.489459
H  5.436512 0.013966 3.870506
H  4.929447 2.152272 -1.515903
H  4.808429 2.605421 0.177686
H  5.907412 1.329787 -0.314232
H  2.945855 3.253882 -1.2048
H  -0.66053 -0.058136 -0.576732
H  0.637749 3.900695 -1.666654
H  7.109806 1.076178 1.528384
H  7.737993 0.257333 2.948675
H  6.952429 1.82357 3.107034
H  -3.345297 2.089472 -1.791188
H  -2.341282 0.653596 -1.939895
H  -2.301652 3.122123 0.836443
H  -3.940699 -1.364796 2.02258
H  -2.79281 2.584075 3.179084
H  -3.602634 0.318966 3.783752
H  -4.691508 -1.832113 -2.230272
H  -0.409968 -3.613606 -0.771697
H  -0.027439 -3.160823 0.89636
H  -1.33135 -4.33039 0.562067
H  -5.817503 -0.001682 -3.622656
H  -6.964122 -0.789823 -2.513346
H  -6.824582 0.97546 -2.539685
totalener: -1459.10699921 hartree
nucrepener: 3264.81232205 hartree
electener: -4723.91932125 hartree
oneelecener: -8480.16043230 hartree
twoeener: 3756.24111105 hartree
kineticenergy: 1452.91202555 hartree
xcener: -140.275354920056 hartree
chargesum: 0.0000000
charge: -0.226333 -0.295669 -0.365115 -0.268248 -0.262361 -0.387768 -0.153547 0.055988 -0.127343 -0.068815 0.014896 -0.125257 0.023020 0.319799 -0.324623 -0.073463 -0.041856 0.286809 -0.241716 -0.254996 0.074639 -0.126993 0.121752 -0.114628 -0.174755 -0.248576 -0.131249 -0.120668 0.440493 0.228760 -0.137104 -0.140014 0.101079 0.091249 0.067063 0.098201 0.064883 0.076246 0.112611 0.113498 0.092971 0.125356 0.068014 0.115539 0.064663 0.080364 0.087356 0.108930 0.107846 0.118899 0.110029 0.123842 0.123126 0.106862 0.109261 0.124783 0.113958 0.109156 0.112598 0.116560
qa: -0.2263 -0.2957 -0.3651 -0.2682 -0.2624 -0.3878 -0.1535 0.0560 -0.1273 -0.0688 0.0149 -0.1253 0.0230 0.3198 -0.3246 -0.0735 -0.0419 0.2868 -0.2417 -0.2550 0.0746 -0.1270 0.1218 -0.1146 -0.1748 -0.2486 -0.1312 -0.1207 0.4405 0.2288 -0.1371 -0.1400 0.1011 0.0912 0.0671 0.0982 0.0649 0.0762 0.1126 0.1135 0.0930 0.1254 0.0680 0.1155 0.0647 0.0804 0.0874 0.1089 0.1078 0.1189 0.1100 0.1238 0.1231 0.1069 0.1093 0.1248 0.1140 0.1092 0.1126 0.1166
va: 2.2303 2.1145 2.1472 2.1134 2.1209 2.1315 3.8581 3.4383 3.8585 3.6489 3.7507 3.8863 4.2957 4.2810 3.9347 3.9117 3.7773 3.8507 4.1135 3.9255 3.7886 3.6988 3.5210 3.9309 4.0535 3.6192 3.9735 3.9585 4.1455 3.9485 3.8718 3.8894 1.0228 0.9998 1.0117 1.0222 1.0020 1.0082 0.9990 0.9894 1.0215 1.0013 1.0757 1.0220 1.0030 1.0057 1.0065 0.9936 1.0012 1.0198 1.0150 1.0009 1.0013 1.0319 1.0004 1.0058 0.9967 0.9854 0.9868 0.9966
dispcorr: -0.033299652 hartree
energy: -1459.140298858383
dipole: 26.94839 -27.51495 -0.56656 5.50749 -3.76741 1.74009 9.03448 -9.53602 -0.50153
magnitude: 1.89748 au
magnitude: 4.82301 debye
