program: Orca
programVersion: 5.0.4
elementType: O O O O O O C C C C C C C C C C C C C C C C C C C C C C C C C C H H H H H H H H H H H H H H H H H H H H H H H H H H H H
charge: 0
multiplicity: 1
keywords: wb97x-d3
keywords: def2-TZVPP
keywords: def2/J RIJCOSX
keywords: DEFGRID2
keywords: scfconv7
keywords: smallprint printgap noloewdin
keywords: NOSOSCF
formula: C26H28O6
InChI: InChI=1/C26H28O6/c1-5-6-10-21-17(2)20-13-12-19(14-24(20)32-26(21)28)31-15-18-9-7-8-11-22(18)23(16-29-3)25(27)30-4/h7-9,11-14,16H,5-6,10,15H2,1-4H3
60 atoms
O  1.65688 -0.451429 -0.404151
O  -1.789717 2.394717 1.148826
O  3.14592 -1.867721 -1.145671
O  -5.231096 -0.597095 1.069863
O  -1.367212 -2.179186 -0.981112
O  -4.382645 -2.540218 1.776122
C  5.375354 -0.195308 -0.735597
C  3.972967 0.227594 -0.408141
C  6.042267 -0.952424 0.41323
C  3.631105 1.412248 0.157224
C  2.239718 1.700673 0.427836
C  7.44954 -1.421606 0.06932
C  1.289649 0.732957 0.120982
C  2.945873 -0.77434 -0.688175
C  4.63822 2.455826 0.527926
C  1.763575 2.900315 0.975934
C  -0.068804 0.916122 0.332217
C  -0.506046 2.111016 0.880709
C  0.424809 3.109443 1.200561
C  8.105917 -2.189823 1.206865
C  -2.766026 1.382445 0.982716
C  -3.105044 1.110451 -0.461098
C  -3.380347 -0.185257 -0.907947
C  -3.156999 2.169761 -1.360493
C  -3.688069 -0.385656 -2.251357
C  -3.322174 -1.358744 -0.004111
C  -3.46572 1.956844 -2.693038
C  -3.730467 0.672387 -3.142099
C  -4.339707 -1.590389 1.034708
C  -2.350881 -2.283452 -0.103584
C  -6.261888 -0.700453 2.03852
C  -0.354218 -3.173377 -0.931739
H  5.356348 -0.835785 -1.618782
H  5.982047 0.670325 -1.008367
H  5.425486 -1.815317 0.678366
H  6.073288 -0.313635 1.302313
H  7.410643 -2.050781 -0.824557
H  8.068026 -0.558328 -0.196181
H  4.459032 3.382744 -0.020147
H  4.567936 2.692468 1.591024
H  5.659779 2.146532 0.331419
H  2.459772 3.6864 1.234773
H  -0.741836 0.127561 0.032245
H  0.075639 4.038702 1.62979
H  8.186988 -1.57537 2.105067
H  9.110914 -2.5185 0.941578
H  7.527868 -3.077178 1.468957
H  -2.447435 0.466118 1.490158
H  -3.645729 1.753844 1.510329
H  -2.94068 3.173677 -1.01793
H  -3.89716 -1.389959 -2.59652
H  -3.49695 2.792898 -3.379221
H  -3.967671 0.494496 -4.182631
H  -2.347411 -3.144403 0.562821
H  -6.8750 -1.587906 1.880724
H  -5.862767 -0.731167 3.052603
H  -6.875777 0.187667 1.916674
H  -0.745838 -4.144804 -1.241127
H  0.432834 -2.864334 -1.61184
H  0.074925 -3.256996 0.068229
totalener: -1459.11144285 hartree
nucrepener: 3221.02812362 hartree
electener: -4680.13956647 hartree
oneelecener: -8392.37790552 hartree
twoeener: 3712.23833905 hartree
kineticenergy: 1452.91524591 hartree
xcener: -140.273162125576 hartree
chargesum: -0.0000000
charge: -0.230138 -0.295469 -0.371914 -0.270980 -0.260025 -0.390158 -0.125909 0.041326 -0.121951 -0.009054 -0.022384 -0.094737 0.021387 0.313853 -0.311014 -0.076454 -0.048983 0.291048 -0.240718 -0.253708 0.054283 -0.106540 0.111989 -0.121963 -0.166378 -0.263453 -0.127047 -0.124811 0.439406 0.240234 -0.144444 -0.144449 0.097775 0.081876 0.083772 0.060502 0.061902 0.050253 0.109469 0.106362 0.091606 0.124631 0.083184 0.116435 0.070012 0.084349 0.076400 0.113046 0.113421 0.118239 0.114298 0.124162 0.123057 0.112256 0.114713 0.109386 0.114282 0.117628 0.129753 0.106384
qa: -0.2301 -0.2955 -0.3719 -0.2710 -0.2600 -0.3902 -0.1259 0.0413 -0.1220 -0.0091 -0.0224 -0.0947 0.0214 0.3139 -0.3110 -0.0765 -0.0490 0.2910 -0.2407 -0.2537 0.0543 -0.1065 0.1120 -0.1220 -0.1664 -0.2635 -0.1270 -0.1248 0.4394 0.2402 -0.1444 -0.1444 0.0978 0.0819 0.0838 0.0605 0.0619 0.0503 0.1095 0.1064 0.0916 0.1246 0.0832 0.1164 0.0700 0.0843 0.0764 0.1130 0.1134 0.1182 0.1143 0.1242 0.1231 0.1123 0.1147 0.1094 0.1143 0.1176 0.1298 0.1064
va: 2.2279 2.1155 2.1429 2.1136 2.1245 2.1278 3.8437 3.5027 3.8388 3.6933 3.7980 3.8822 4.2813 4.2813 3.9464 3.9170 3.7923 3.8649 4.1178 3.9516 3.8300 3.6895 3.5195 3.9403 4.0361 3.6093 3.9664 3.9616 4.1580 3.9183 3.9053 3.8617 1.0266 1.0020 1.0195 1.0106 1.0092 1.0080 0.9950 0.9930 1.0126 1.0016 1.0529 1.0217 1.0030 1.0062 1.0039 1.0012 0.9908 1.0203 1.0133 1.0009 1.0013 1.0316 0.9966 0.9945 0.9940 0.9866 1.0093 0.9918
dispcorr: -0.031906386 hartree
energy: -1459.143349233006
dipole: 34.70976 -34.41043 0.29934 -4.29014 5.45466 1.16452 4.61109 -4.39670 0.21439
magnitude: 1.22134 au
magnitude: 3.10440 debye
