program: Orca
programVersion: 5.0.4
elementType: O O O O O O C C C C C C C C C C C C C C C C C C C C C C C C C C H H H H H H H H H H H H H H H H H H H H H H H H H H H H
charge: 0
multiplicity: 1
keywords: wb97x-d3
keywords: def2-TZVPP
keywords: def2/J RIJCOSX
keywords: DEFGRID2
keywords: scfconv7
keywords: smallprint printgap noloewdin
keywords: NOSOSCF
formula: C26H28O6
InChI: InChI=1/C26H28O6/c1-5-6-10-21-17(2)20-13-12-19(14-24(20)32-26(21)28)31-15-18-9-7-8-11-22(18)23(16-29-3)25(27)30-4/h7-9,11-14,16H,5-6,10,15H2,1-4H3
60 atoms
O  1.74125 -0.750593 0.57601
O  -1.711928 2.431829 1.140134
O  3.222851 -2.308145 0.200509
O  -5.243557 -0.421682 0.664226
O  -1.156284 -2.380157 -0.38783
O  -4.69079 -2.326459 1.695031
C  5.490425 -0.618334 0.502651
C  4.074048 -0.14367 0.675739
C  6.094292 -0.24523 -0.855777
C  3.729522 1.134515 0.973782
C  2.333707 1.503571 1.0522
C  5.32332 -0.779998 -2.055929
C  1.376632 0.519575 0.831232
C  3.034964 -1.149951 0.463397
C  4.745047 2.207862 1.214101
C  1.859468 2.798431 1.307492
C  0.01388 0.774578 0.85072
C  -0.421983 2.06553 1.099804
C  0.515654 3.081688 1.333162
C  6.007317 -0.444116 -3.373237
C  -2.710313 1.457799 0.891772
C  -2.770269 1.031733 -0.553805
C  -3.015474 -0.295947 -0.914759
C  -2.58995 1.988255 -1.547714
C  -3.062274 -0.630933 -2.266016
C  -3.207636 -1.369797 0.089069
C  -2.639897 1.642055 -2.886704
C  -2.875695 0.324877 -3.248668
C  -4.430948 -1.454002 0.904431
C  -2.303873 -2.350424 0.266915
C  -6.476785 -0.404584 1.365745
C  -0.287307 -3.471505 -0.123691
H  6.120683 -0.215067 1.298509
H  5.519317 -1.701388 0.619886
H  7.12136 -0.622127 -0.889105
H  6.170561 0.844255 -0.93856
H  5.203519 -1.862062 -1.963023
H  4.312345 -0.363803 -2.059858
H  4.573784 2.69241 2.176676
H  5.763471 1.832566 1.211046
H  4.677135 2.98221 0.447572
H  2.560906 3.602383 1.484378
H  -0.658935 -0.04133 0.637701
H  0.167294 4.086677 1.52893
H  6.111446 0.634651 -3.503379
H  5.441682 -0.823564 -4.224296
H  7.007552 -0.877703 -3.424088
H  -2.574053 0.596341 1.553493
H  -3.645495 1.938874 1.18119
H  -2.395568 3.016825 -1.271418
H  -3.251266 -1.659743 -2.543805
H  -2.49393 2.399516 -3.645471
H  -2.913783 0.042255 -4.292357
H  -2.495611 -3.14181 0.989585
H  -7.080235 -1.284289 1.140528
H  -6.329349 -0.354209 2.445166
H  -6.99942 0.486864 1.028963
H  -0.163107 -3.633991 0.948752
H  -0.663395 -4.386335 -0.586053
H  0.681845 -3.222379 -0.543658
totalener: -1459.10989792 hartree
nucrepener: 3269.37136139 hartree
electener: -4728.48125930 hartree
oneelecener: -8489.13937977 hartree
twoeener: 3760.65812047 hartree
kineticenergy: 1452.91026388 hartree
xcener: -140.274233626817 hartree
chargesum: -0.0000000
charge: -0.230146 -0.293374 -0.374109 -0.270854 -0.254921 -0.390479 -0.139568 0.015365 -0.146741 0.012622 -0.019544 -0.074571 0.040508 0.328098 -0.324526 -0.078971 -0.038103 0.277192 -0.233781 -0.259598 0.060217 -0.126670 0.121354 -0.115970 -0.171364 -0.263487 -0.130119 -0.123751 0.436558 0.249580 -0.143833 -0.139172 0.088556 0.102789 0.070758 0.058452 0.073351 0.056993 0.106666 0.092035 0.114729 0.125193 0.072395 0.116444 0.069232 0.086674 0.072779 0.112152 0.112534 0.118149 0.113298 0.123772 0.123282 0.105604 0.113699 0.109459 0.114340 0.100329 0.117032 0.131465
qa: -0.2301 -0.2934 -0.3741 -0.2709 -0.2549 -0.3905 -0.1396 0.0154 -0.1467 0.0126 -0.0195 -0.0746 0.0405 0.3281 -0.3245 -0.0790 -0.0381 0.2772 -0.2338 -0.2596 0.0602 -0.1267 0.1214 -0.1160 -0.1714 -0.2635 -0.1301 -0.1238 0.4366 0.2496 -0.1438 -0.1392 0.0886 0.1028 0.0708 0.0585 0.0734 0.0570 0.1067 0.0920 0.1147 0.1252 0.0724 0.1164 0.0692 0.0867 0.0728 0.1122 0.1125 0.1181 0.1133 0.1238 0.1233 0.1056 0.1137 0.1095 0.1143 0.1003 0.1170 0.1315
va: 2.2292 2.1178 2.1360 2.1147 2.1310 2.1281 3.8585 3.4686 3.8948 3.6478 3.7951 3.8512 4.2593 4.2508 3.9438 3.9206 3.7865 3.8781 4.1052 3.9549 3.8247 3.6993 3.5087 3.9360 4.0396 3.6007 3.9678 3.9599 4.1563 3.9154 3.9062 3.8612 1.0008 1.0283 1.0135 1.0049 1.0132 1.0104 0.9978 1.0134 0.9905 1.0016 1.0495 1.0216 1.0023 1.0054 1.0034 0.9988 0.9912 1.0195 1.0136 1.0010 1.0013 1.0341 0.9966 0.9943 0.9939 0.9922 0.9869 1.0113
dispcorr: -0.032887518 hartree
energy: -1459.142785434891
dipole: 27.91170 -27.62070 0.29100 1.12076 0.05376 1.17452 -10.61411 10.50836 -0.10575
magnitude: 1.21464 au
magnitude: 3.08738 debye
