program: Orca
programVersion: 5.0.4
elementType: O O O O O O C C C C C C C C C C C C C C C C C C C C C C C C C C H H H H H H H H H H H H H H H H H H H H H H H H H H H H
charge: 0
multiplicity: 1
keywords: wb97x-d3
keywords: def2-TZVPP
keywords: def2/J RIJCOSX
keywords: DEFGRID2
keywords: scfconv7
keywords: smallprint printgap noloewdin
keywords: NOSOSCF
formula: C26H28O6
InChI: InChI=1/C26H28O6/c1-5-6-10-21-17(2)20-13-12-19(14-24(20)32-26(21)28)31-15-18-9-7-8-11-22(18)23(16-29-3)25(27)30-4/h7-9,11-14,16H,5-6,10,15H2,1-4H3
60 atoms
O  1.775977 -0.848844 0.517075
O  -1.630703 2.334032 1.308605
O  3.239789 -2.404084 0.065725
O  -5.197336 -0.426259 0.678047
O  -1.1423 -2.423605 -0.431031
O  -4.69801 -2.39461 1.611358
C  5.501454 -0.768975 0.2588
C  4.116481 -0.249016 0.512532
C  5.859039 -0.970838 -1.219874
C  3.795269 1.02571 0.850141
C  2.403902 1.39261 1.009183
C  5.809653 0.28485 -2.09445
C  1.431568 0.417367 0.816693
C  3.061421 -1.247931 0.344597
C  4.808267 2.112918 1.030768
C  1.947056 2.682453 1.317114
C  0.072965 0.676671 0.908929
C  -0.345166 1.963469 1.204431
C  0.607448 2.969792 1.41565
C  4.438845 0.615079 -2.675438
C  -2.641792 1.386441 1.013368
C  -2.699351 1.03166 -0.451623
C  -2.955982 -0.273925 -0.878898
C  -2.496117 2.03269 -1.395834
C  -2.989014 -0.543008 -2.245301
C  -3.178054 -1.390668 0.06998
C  -2.53285 1.752116 -2.750538
C  -2.778049 0.456553 -3.178372
C  -4.410385 -1.487909 0.870484
C  -2.297821 -2.398417 0.209568
C  -6.437118 -0.419546 1.368116
C  -0.311522 -3.557059 -0.227807
H  6.242565 -0.108741 0.709694
H  5.611076 -1.729367 0.766691
H  5.220368 -1.746394 -1.648348
H  6.873374 -1.377418 -1.241673
H  6.193822 1.143718 -1.534552
H  6.504153 0.148791 -2.92735
H  4.674806 2.886527 0.271629
H  4.693437 2.59242 2.004098
H  5.830965 1.759497 0.957993
H  2.658478 3.481112 1.475886
H  -0.612452 -0.133699 0.7155
H  0.274654 3.972002 1.649091
H  4.500005 1.460116 -3.362301
H  3.706593 0.870914 -1.91156
H  4.041074 -0.232612 -3.235596
H  -2.519165 0.49249 1.633444
H  -3.570783 1.866069 1.32395
H  -2.293423 3.044416 -1.068003
H  -3.187228 -1.554662 -2.575002
H  -2.368316 2.543544 -3.46977
H  -2.805204 0.224612 -4.234837
H  -2.518581 -3.220665 0.88825
H  -7.062878 -1.264398 1.078738
H  -6.300488 -0.445807 2.44983
H  -6.930712 0.507222 1.087097
H  0.687798 -3.291413 -0.55792
H  -0.262271 -3.832903 0.827869
H  -0.674224 -4.409992 -0.804635
totalener: -1459.10601951 hartree
nucrepener: 3301.13792774 hartree
electener: -4760.24394725 hartree
oneelecener: -8552.67102296 hartree
twoeener: 3792.42707571 hartree
kineticenergy: 1452.91301893 hartree
xcener: -140.275888132908 hartree
chargesum: 0.0000000
charge: -0.229318 -0.293230 -0.376367 -0.270976 -0.253025 -0.390692 -0.162140 0.043927 -0.121206 -0.065468 0.008494 -0.125746 0.049314 0.334266 -0.320442 -0.066227 -0.049168 0.272266 -0.231099 -0.246911 0.060015 -0.129262 0.121544 -0.114136 -0.172634 -0.263607 -0.130507 -0.123358 0.436136 0.251926 -0.143555 -0.133670 0.089202 0.097707 0.085238 0.074626 0.052067 0.077504 0.112531 0.111029 0.094696 0.124943 0.073782 0.115856 0.085862 0.072472 0.081858 0.111268 0.111646 0.118255 0.113317 0.123812 0.123267 0.103402 0.113960 0.109345 0.114093 0.131937 0.095778 0.115403
qa: -0.2293 -0.2932 -0.3764 -0.2710 -0.2530 -0.3907 -0.1621 0.0439 -0.1212 -0.0655 0.0085 -0.1257 0.0493 0.3343 -0.3204 -0.0662 -0.0492 0.2723 -0.2311 -0.2469 0.0600 -0.1293 0.1215 -0.1141 -0.1726 -0.2636 -0.1305 -0.1234 0.4361 0.2519 -0.1436 -0.1337 0.0892 0.0977 0.0852 0.0746 0.0521 0.0775 0.1125 0.1110 0.0947 0.1249 0.0738 0.1159 0.0859 0.0725 0.0819 0.1113 0.1116 0.1183 0.1133 0.1238 0.1233 0.1034 0.1140 0.1093 0.1141 0.1319 0.0958 0.1154
va: 2.2253 2.1174 2.1383 2.1154 2.1327 2.1279 3.8988 3.4068 3.8419 3.6378 3.7481 3.8816 4.2540 4.2580 3.9316 3.9073 3.7977 3.8759 4.1045 3.9177 3.8249 3.6978 3.5089 3.9343 4.0404 3.6023 3.9681 3.9597 4.1559 3.9133 3.9061 3.8609 0.9997 1.0207 1.0194 1.0093 1.0052 1.0044 0.9897 0.9989 1.0172 1.0010 1.0483 1.0216 1.0068 1.0068 1.0069 0.9980 0.9916 1.0190 1.0137 1.0009 1.0013 1.0355 0.9962 0.9947 0.9939 1.0121 0.9926 0.9873
dispcorr: -0.034300445 hartree
energy: -1459.140319954204
dipole: 24.98009 -24.65216 0.32793 3.62678 -2.45779 1.16899 -10.14079 9.99204 -0.14875
magnitude: 1.22319 au
magnitude: 3.10910 debye
