program: Orca
programVersion: 5.0.4
elementType: O O O O O O C C C C C C C C C C C C C C C C C C C C C C C C C C H H H H H H H H H H H H H H H H H H H H H H H H H H H H
charge: 0
multiplicity: 1
keywords: wb97x-d3
keywords: def2-TZVPP
keywords: def2/J RIJCOSX
keywords: DEFGRID2
keywords: scfconv7
keywords: smallprint printgap noloewdin
keywords: NOSOSCF
formula: C26H28O6
InChI: InChI=1/C26H28O6/c1-5-6-10-21-17(2)20-13-12-19(14-24(20)32-26(21)28)31-15-18-9-7-8-11-22(18)23(16-29-3)25(27)30-4/h7-9,11-14,16H,5-6,10,15H2,1-4H3
60 atoms
O  1.775754 -0.850084 0.485139
O  -1.62479 2.333305 1.300117
O  3.236942 -2.407343 0.032628
O  -5.198909 -0.421258 0.690237
O  -1.154039 -2.414832 -0.460674
O  -4.695865 -2.397263 1.605376
C  5.505079 -0.788801 0.284312
C  4.119284 -0.263788 0.523218
C  5.884971 -0.975179 -1.190647
C  3.800044 1.008005 0.873718
C  2.408595 1.37997 1.020194
C  5.865045 0.292287 -2.048893
C  1.43392 0.412705 0.80152
C  3.061232 -1.254247 0.325647
C  4.816204 2.087336 1.082197
C  1.954165 2.667041 1.343274
C  0.075509 0.676433 0.884309
C  -0.340052 1.959697 1.198226
C  0.614886 2.958661 1.43358
C  4.506964 0.652143 -2.641931
C  -2.638129 1.387137 1.008294
C  -2.708343 1.038492 -0.457533
C  -2.971543 -0.264916 -0.887654
C  -2.511305 2.042831 -1.399508
C  -3.016995 -0.528395 -2.254803
C  -3.186745 -1.385353 0.058562
C  -2.560794 1.767793 -2.754938
C  -2.812388 0.474508 -3.185727
C  -4.412716 -1.485953 0.868403
C  -2.304875 -2.393068 0.18831
C  -6.431487 -0.414953 1.393059
C  -0.321159 -3.549041 -0.270331
H  6.24296 -0.138823 0.754979
H  5.600903 -1.755771 0.782335
H  5.245067 -1.737612 -1.640223
H  6.895003 -1.392933 -1.201146
H  6.255783 1.137565 -1.472962
H  6.567485 0.156171 -2.875098
H  4.695177 2.550249 2.062767
H  5.837899 1.730688 1.011648
H  4.692473 2.874573 0.335595
H  2.66742 3.459762 1.522395
H  -0.611127 -0.127595 0.670183
H  0.284131 3.958281 1.68066
H  3.769884 0.910743 -1.883667
H  4.101931 -0.181811 -3.217326
H  4.590524 1.504382 -3.317444
H  -2.510147 0.490404 1.623317
H  -3.564715 1.865229 1.328351
H  -2.303521 3.052784 -1.06955
H  -3.220117 -1.538307 -2.586778
H  -2.401234 2.561758 -3.472489
H  -2.849363 0.246916 -4.242816
H  -2.52022 -3.218549 0.864798
H  -6.283537 -0.444052 2.473202
H  -6.926536 0.513213 1.119715
H  -7.061483 -1.258067 1.108224
H  0.678014 -3.277587 -0.596726
H  -0.272275 -3.837448 0.782065
H  -0.682024 -4.395747 -0.857683
totalener: -1459.10610641 hartree
nucrepener: 3298.67075015 hartree
electener: -4757.77685656 hartree
oneelecener: -8547.73402284 hartree
twoeener: 3789.95716628 hartree
kineticenergy: 1452.91181326 hartree
xcener: -140.275707906690 hartree
chargesum: 0.0000000
charge: -0.229587 -0.293210 -0.376525 -0.270975 -0.253456 -0.390716 -0.162375 0.046753 -0.120588 -0.069049 0.008772 -0.126146 0.045059 0.333344 -0.319161 -0.065227 -0.045477 0.275202 -0.233551 -0.247108 0.061002 -0.127862 0.120768 -0.114830 -0.172005 -0.264791 -0.130163 -0.123619 0.436541 0.252219 -0.143712 -0.132376 0.089288 0.097805 0.085339 0.074578 0.051836 0.077507 0.111433 0.094098 0.112156 0.124904 0.072606 0.115824 0.072513 0.081992 0.085978 0.111240 0.111881 0.118318 0.113317 0.123850 0.123268 0.103579 0.109372 0.114123 0.113976 0.131879 0.095095 0.115094
qa: -0.2296 -0.2932 -0.3765 -0.2710 -0.2535 -0.3907 -0.1624 0.0468 -0.1206 -0.0690 0.0088 -0.1261 0.0451 0.3333 -0.3192 -0.0652 -0.0455 0.2752 -0.2336 -0.2471 0.0610 -0.1279 0.1208 -0.1148 -0.1720 -0.2648 -0.1302 -0.1236 0.4365 0.2522 -0.1437 -0.1324 0.0893 0.0978 0.0853 0.0746 0.0518 0.0775 0.1114 0.0941 0.1122 0.1249 0.0726 0.1158 0.0725 0.0820 0.0860 0.1112 0.1119 0.1183 0.1133 0.1239 0.1233 0.1036 0.1094 0.1141 0.1140 0.1319 0.0951 0.1151
va: 2.2254 2.1177 2.1382 2.1151 2.1324 2.1278 3.8990 3.4052 3.8417 3.6397 3.7479 3.8821 4.2597 4.2578 3.9314 3.9070 3.7955 3.8733 4.1074 3.9177 3.8238 3.6965 3.5103 3.9341 4.0400 3.6045 3.9680 3.9599 4.1557 3.9129 3.9061 3.8607 0.9996 1.0206 1.0195 1.0093 1.0052 1.0044 0.9988 1.0176 0.9899 1.0010 1.0496 1.0217 1.0065 1.0070 1.0068 0.9985 0.9914 1.0191 1.0136 1.0009 1.0013 1.0355 0.9946 0.9939 0.9963 1.0122 0.9928 0.9874
dispcorr: -0.034252910 hartree
energy: -1459.140359318658
dipole: 25.22508 -24.89421 0.33087 3.67048 -2.50414 1.16634 -9.76343 9.64670 -0.11673
magnitude: 1.21797 au
magnitude: 3.09583 debye
