program: Orca
programVersion: 5.0.4
elementType: O O O O O O C C C C C C C C C C C C C C C C C C C C C C C C C C H H H H H H H H H H H H H H H H H H H H H H H H H H H H
charge: 0
multiplicity: 1
keywords: wb97x-d3
keywords: def2-TZVPP
keywords: def2/J RIJCOSX
keywords: DEFGRID2
keywords: scfconv7
keywords: smallprint printgap noloewdin
keywords: NOSOSCF
formula: C26H28O6
InChI: InChI=1/C26H28O6/c1-5-6-10-21-17(2)20-13-12-19(14-24(20)32-26(21)28)31-15-18-9-7-8-11-22(18)23(16-29-3)25(27)30-4/h7-9,11-14,16H,5-6,10,15H2,1-4H3
60 atoms
O  1.780798 -0.848858 0.435759
O  -1.615068 2.332109 1.28123
O  3.240343 -2.408749 -0.012494
O  -5.208032 -0.416983 0.715587
O  -1.177724 -2.401296 -0.49831
O  -4.699691 -2.40471 1.602198
C  5.5146 -0.813361 0.323101
C  4.12708 -0.280655 0.535319
C  5.931244 -0.986405 -1.143356
C  3.808838 0.987457 0.899994
C  2.417109 1.365483 1.028151
C  5.955883 0.292026 -1.984566
C  1.440741 0.408757 0.773908
C  3.066589 -1.259507 0.29604
C  4.827337 2.057145 1.14457
C  1.964505 2.648117 1.370819
C  0.082462 0.677811 0.842952
C  -0.331126 1.955416 1.181754
C  0.625549 2.944648 1.44953
C  4.618419 0.690014 -2.599531
C  -2.631478 1.386157 1.000213
C  -2.726592 1.044514 -0.465722
C  -3.004031 -0.255799 -0.896461
C  -2.541955 2.051896 -1.406924
C  -3.075704 -0.513245 -2.263577
C  -3.207007 -1.380101 0.048091
C  -2.617908 1.782838 -2.762381
C  -2.883584 0.49269 -3.193948
C  -4.423335 -1.486158 0.871708
C  -2.321428 -2.386098 0.1637
C  -6.430844 -0.413402 1.435291
C  -0.337165 -3.531532 -0.317761
H  6.245412 -0.175103 0.820189
H  5.590204 -1.786658 0.812276
H  5.292051 -1.732398 -1.62052
H  6.934601 -1.420036 -1.132225
H  6.353265 1.1209 -1.389497
H  6.671978 0.151071 -2.798157
H  4.698322 2.497424 2.134567
H  5.848245 1.698034 1.075354
H  4.714073 2.862194 0.415564
H  2.679087 3.432928 1.577417
H  -0.605111 -0.117158 0.599841
H  0.296484 3.940178 1.71474
H  3.872704 0.95545 -1.852212
H  4.206094 -0.127059 -3.193657
H  4.73461 1.548696 -3.261943
H  -2.492079 0.486271 1.608164
H  -3.553619 1.861032 1.337605
H  -2.323416 3.059456 -1.076681
H  -3.289181 -1.520934 -2.595877
H  -2.468078 2.579164 -3.479412
H  -2.940999 0.269745 -4.251113
H  -2.525278 -3.213635 0.841241
H  -6.926575 0.518785 1.17736
H  -7.067422 -1.251894 1.151491
H  -6.268178 -0.452859 2.512999
H  0.654383 -3.258605 -0.665665
H  -0.266141 -3.813349 0.735149
H  -0.706543 -4.38308 -0.892901
totalener: -1459.10622483 hartree
nucrepener: 3293.52020136 hartree
electener: -4752.62642618 hartree
oneelecener: -8537.42667741 hartree
twoeener: 3784.80025123 hartree
kineticenergy: 1452.90915564 hartree
xcener: -140.275052649455 hartree
chargesum: 0.0000000
charge: -0.229786 -0.293520 -0.375688 -0.271072 -0.254695 -0.390641 -0.163104 0.049097 -0.119743 -0.073128 0.008985 -0.126496 0.038542 0.332495 -0.316556 -0.064790 -0.042483 0.278932 -0.236036 -0.247675 0.062413 -0.124547 0.119423 -0.116368 -0.170744 -0.266968 -0.129687 -0.123888 0.438007 0.251259 -0.143723 -0.133160 0.089396 0.098090 0.085471 0.074305 0.051690 0.077412 0.111950 0.092829 0.111558 0.124922 0.073507 0.115867 0.072726 0.082187 0.086126 0.111221 0.112095 0.118435 0.113405 0.123953 0.123314 0.104479 0.114109 0.113924 0.109360 0.131944 0.095720 0.115348
qa: -0.2298 -0.2935 -0.3757 -0.2711 -0.2547 -0.3906 -0.1631 0.0491 -0.1197 -0.0731 0.0090 -0.1265 0.0385 0.3325 -0.3166 -0.0648 -0.0425 0.2789 -0.2360 -0.2477 0.0624 -0.1245 0.1194 -0.1164 -0.1707 -0.2670 -0.1297 -0.1239 0.4380 0.2513 -0.1437 -0.1332 0.0894 0.0981 0.0855 0.0743 0.0517 0.0774 0.1120 0.0928 0.1116 0.1249 0.0735 0.1159 0.0727 0.0822 0.0861 0.1112 0.1121 0.1184 0.1134 0.1240 0.1233 0.1045 0.1141 0.1139 0.1094 0.1319 0.0957 0.1153
va: 2.2253 2.1180 2.1391 2.1146 2.1312 2.1279 3.8995 3.4020 3.8421 3.6404 3.7491 3.8830 4.2675 4.2584 3.9311 3.9074 3.7934 3.8699 4.1110 3.9178 3.8228 3.6957 3.5115 3.9347 4.0395 3.6072 3.9677 3.9602 4.1550 3.9139 3.9062 3.8607 0.9993 1.0202 1.0196 1.0094 1.0052 1.0043 0.9985 1.0182 0.9902 1.0009 1.0505 1.0217 1.0059 1.0070 1.0068 0.9991 0.9913 1.0193 1.0135 1.0009 1.0013 1.0351 0.9939 0.9963 0.9945 1.0119 0.9927 0.9873
dispcorr: -0.034154866 hartree
energy: -1459.140379692314
dipole: 25.61547 -25.28487 0.33061 3.69602 -2.53095 1.16507 -9.19755 9.12958 -0.06797
magnitude: 1.21298 au
magnitude: 3.08314 debye
