program: Orca
programVersion: 5.0.4
elementType: O O O O O O C C C C C C C C C C C C C C C C C C C C C C C C C C H H H H H H H H H H H H H H H H H H H H H H H H H H H H
charge: 0
multiplicity: 1
keywords: wb97x-d3
keywords: def2-TZVPP
keywords: def2/J RIJCOSX
keywords: DEFGRID2
keywords: scfconv7
keywords: smallprint printgap noloewdin
keywords: NOSOSCF
formula: C26H28O6
InChI: InChI=1/C26H28O6/c1-5-6-10-21-17(2)20-13-12-19(14-24(20)32-26(21)28)31-15-18-9-7-8-11-22(18)23(16-29-3)25(27)30-4/h7-9,11-14,16H,5-6,10,15H2,1-4H3
60 atoms
O  1.784144 -0.847963 0.418713
O  -1.610774 2.331238 1.276705
O  3.243718 -2.407848 -0.029818
O  -5.213803 -0.41571 0.722803
O  -1.188283 -2.39731 -0.510947
O  -4.702967 -2.406133 1.601957
C  5.519253 -0.819544 0.333463
C  4.131087 -0.285021 0.537904
C  5.948086 -0.988798 -1.129856
C  3.812789 0.981243 0.908993
C  2.420924 1.36049 1.032446
C  5.988368 0.292868 -1.965322
C  1.444357 0.407537 0.765118
C  3.070224 -1.260663 0.286261
C  4.831406 2.047963 1.166024
C  1.968686 2.640969 1.383555
C  0.08608 0.678348 0.829461
C  -0.327103 1.953447 1.1782
C  0.629856 2.938892 1.458823
C  4.658195 0.703662 -2.587555
C  -2.6284 1.385788 0.9989
C  -2.732207 1.046951 -0.467036
C  -3.015521 -0.252011 -0.897902
C  -2.550977 2.055204 -1.407991
C  -3.096229 -0.50744 -2.264878
C  -3.215173 -1.377569 0.045947
C  -2.636321 1.788226 -2.763315
C  -2.907791 0.499366 -3.195051
C  -4.428594 -1.485288 0.873581
C  -2.329183 -2.383707 0.156157
C  -6.435575 -0.415737 1.444518
C  -0.347796 -3.528369 -0.336397
H  6.2474 -0.184819 0.838896
H  5.588832 -1.794677 0.819841
H  5.308737 -1.728805 -1.616024
H  6.948672 -1.428612 -1.11153
H  6.388121 1.116254 -1.364171
H  6.708925 0.149641 -2.774586
H  5.852308 1.690053 1.091279
H  4.717405 2.861988 0.447226
H  4.703103 2.475944 2.161529
H  2.683527 3.422686 1.600741
H  -0.601634 -0.113192 0.575633
H  0.30109 3.932438 1.731739
H  4.243917 -0.107565 -3.188344
H  4.78499 1.564668 -3.244985
H  3.90961 0.97077 -1.843717
H  -2.48549 0.484534 1.604032
H  -3.548856 1.859703 1.342275
H  -2.328102 3.061786 -1.077717
H  -3.3142 -1.514198 -2.597077
H  -2.489232 2.585186 -3.480207
H  -2.972411 0.277985 -4.252124
H  -2.530887 -3.213456 0.831633
H  -6.933446 0.515944 1.189026
H  -7.070928 -1.254984 1.160227
H  -6.271097 -0.456813 2.521896
H  0.638441 -3.259839 -0.702403
H  -0.25986 -3.80295 0.717206
H  -0.728192 -4.383254 -0.899504
totalener: -1459.10626219 hartree
nucrepener: 3291.21888125 hartree
electener: -4750.32514344 hartree
oneelecener: -8532.82524212 hartree
twoeener: 3782.50009868 hartree
kineticenergy: 1452.90680533 hartree
xcener: -140.274461094609 hartree
chargesum: 0.0000000
charge: -0.229414 -0.293619 -0.375097 -0.271104 -0.255243 -0.390661 -0.163799 0.049329 -0.119133 -0.074643 0.009230 -0.126513 0.036155 0.332533 -0.314999 -0.065098 -0.041976 0.280604 -0.236927 -0.247700 0.062228 -0.122923 0.118896 -0.116814 -0.170161 -0.267556 -0.129391 -0.124248 0.438452 0.250530 -0.143653 -0.133758 0.089495 0.098165 0.085384 0.074277 0.051582 0.077303 0.092043 0.111049 0.112296 0.124897 0.074224 0.115821 0.082191 0.086125 0.072715 0.111309 0.112181 0.118432 0.113435 0.124014 0.123388 0.105231 0.114132 0.113841 0.109369 0.131428 0.096564 0.115582
qa: -0.2294 -0.2936 -0.3751 -0.2711 -0.2552 -0.3907 -0.1638 0.0493 -0.1191 -0.0746 0.0092 -0.1265 0.0362 0.3325 -0.3150 -0.0651 -0.0420 0.2806 -0.2369 -0.2477 0.0622 -0.1229 0.1189 -0.1168 -0.1702 -0.2676 -0.1294 -0.1242 0.4385 0.2505 -0.1437 -0.1338 0.0895 0.0982 0.0854 0.0743 0.0516 0.0773 0.0920 0.1110 0.1123 0.1249 0.0742 0.1158 0.0822 0.0861 0.0727 0.1113 0.1122 0.1184 0.1134 0.1240 0.1234 0.1052 0.1141 0.1138 0.1094 0.1314 0.0966 0.1156
va: 2.2253 2.1179 2.1397 2.1145 2.1306 2.1279 3.9006 3.3997 3.8423 3.6402 3.7492 3.8835 4.2705 4.2592 3.9307 3.9070 3.7928 3.8683 4.1122 3.9179 3.8232 3.6954 3.5117 3.9349 4.0395 3.6083 3.9675 3.9607 4.1548 3.9139 3.9063 3.8613 0.9992 1.0200 1.0197 1.0094 1.0053 1.0043 1.0186 0.9905 0.9983 1.0009 1.0508 1.0218 1.0070 1.0068 1.0057 0.9993 0.9912 1.0194 1.0134 1.0009 1.0013 1.0348 0.9939 0.9964 0.9944 1.0116 0.9924 0.9872
dispcorr: -0.034099838 hartree
energy: -1459.140362025561
dipole: 25.73189 -25.40659 0.32530 3.69099 -2.53052 1.16048 -9.03868 8.98536 -0.05332
magnitude: 1.20639 au
magnitude: 3.06639 debye
