program: Orca
programVersion: 5.0.4
elementType: O O O O O O C C C C C C C C C C C C C C C C C C C C C C C C C C H H H H H H H H H H H H H H H H H H H H H H H H H H H H
charge: 0
multiplicity: 1
keywords: wb97x-d3
keywords: def2-TZVPP
keywords: def2/J RIJCOSX
keywords: DEFGRID2
keywords: scfconv7
keywords: smallprint printgap noloewdin
keywords: NOSOSCF
formula: C26H28O6
InChI: InChI=1/C26H28O6/c1-5-6-10-21-17(2)20-13-12-19(14-24(20)32-26(21)28)31-15-18-9-7-8-11-22(18)23(16-29-3)25(27)30-4/h7-9,11-14,16H,5-6,10,15H2,1-4H3
60 atoms
O  1.652594 -0.454233 -0.396497
O  -1.780519 2.398126 1.170589
O  3.136268 -1.883622 -1.122536
O  -5.16823 -0.633728 1.125746
O  -1.345228 -2.134404 -1.060119
O  -4.306879 -2.6046 1.733285
C  5.375119 -0.233951 -0.68974
C  3.97257 0.210952 -0.39305
C  6.003508 -0.983831 0.485654
C  3.633251 1.406934 0.149823
C  2.242409 1.704017 0.414054
C  7.405499 -1.494814 0.182579
C  1.289755 0.734808 0.120786
C  2.941023 -0.786474 -0.671608
C  4.642897 2.453402 0.504813
C  1.769821 2.909321 0.953414
C  -0.067067 0.919763 0.340413
C  -0.499962 2.117125 0.88618
C  0.432929 3.119733 1.187425
C  8.008541 -2.268017 1.34628
C  -2.757459 1.384945 1.00983
C  -3.117664 1.129824 -0.431897
C  -3.380613 -0.161224 -0.899026
C  -3.205378 2.205976 -1.308724
C  -3.714538 -0.338661 -2.239841
C  -3.287543 -1.354817 -0.024306
C  -3.539602 2.015583 -2.638294
C  -3.794172 0.736206 -3.107346
C  -4.279228 -1.625844 1.029565
C  -2.31157 -2.269201 -0.168786
C  -6.176637 -0.777743 2.112999
C  -0.342502 -3.139559 -1.083482
H  5.364139 -0.887748 -1.563133
H  6.000282 0.618263 -0.962563
H  5.361317 -1.826882 0.754734
H  6.031528 -0.328887 1.36305
H  7.371855 -2.133777 -0.704503
H  8.055017 -0.652621 -0.076028
H  4.573949 2.708072 1.56369
H  5.663507 2.138824 0.3122
H  4.465045 3.371156 -0.058848
H  2.46796 3.697647 1.199866
H  -0.741887 0.128568 0.052466
H  0.086553 4.052275 1.6118
H  9.01124 -2.627079 1.113927
H  7.398667 -3.136126 1.600603
H  8.080543 -1.64629 2.24024
H  -2.430151 0.464319 1.50343
H  -3.629717 1.749674 1.554059
H  -2.998106 3.206102 -0.949879
H  -3.915608 -1.338839 -2.601186
H  -3.599827 2.864645 -3.306316
H  -4.052818 0.575613 -4.145565
H  -2.289164 -3.147212 0.474509
H  -6.804653 0.105315 2.029739
H  -6.781526 -1.669103 1.94489
H  -5.754164 -0.830629 3.117204
H  0.465817 -2.775241 -1.709159
H  0.059597 -3.327501 -0.086237
H  -0.735121 -4.070566 -1.497752
totalener: -1459.11141632 hartree
nucrepener: 3222.86720876 hartree
electener: -4681.97862507 hartree
oneelecener: -8396.06691665 hartree
twoeener: 3714.08829158 hartree
kineticenergy: 1452.91202928 hartree
xcener: -140.272683153814 hartree
chargesum: 0.0000000
charge: -0.230619 -0.294913 -0.373205 -0.271631 -0.258773 -0.390780 -0.126688 0.043268 -0.120324 -0.010362 -0.019521 -0.094884 0.021457 0.312748 -0.311327 -0.077652 -0.042666 0.288283 -0.239136 -0.253447 0.056274 -0.109325 0.113642 -0.122850 -0.168387 -0.263314 -0.127639 -0.124160 0.439729 0.244325 -0.143884 -0.140268 0.097650 0.081682 0.082758 0.060804 0.061653 0.050455 0.106023 0.092102 0.109655 0.124619 0.078260 0.116290 0.084512 0.076290 0.070032 0.112147 0.113450 0.118275 0.113980 0.124261 0.123182 0.109496 0.114085 0.114337 0.109412 0.129006 0.103809 0.117802
qa: -0.2306 -0.2949 -0.3732 -0.2716 -0.2588 -0.3908 -0.1267 0.0433 -0.1203 -0.0104 -0.0195 -0.0949 0.0215 0.3127 -0.3113 -0.0777 -0.0427 0.2883 -0.2391 -0.2534 0.0563 -0.1093 0.1136 -0.1229 -0.1684 -0.2633 -0.1276 -0.1242 0.4397 0.2443 -0.1439 -0.1403 0.0976 0.0817 0.0828 0.0608 0.0617 0.0505 0.1060 0.0921 0.1097 0.1246 0.0783 0.1163 0.0845 0.0763 0.0700 0.1121 0.1134 0.1183 0.1140 0.1243 0.1232 0.1095 0.1141 0.1143 0.1094 0.1290 0.1038 0.1178
va: 2.2284 2.1160 2.1416 2.1138 2.1266 2.1274 3.8446 3.5067 3.8401 3.6933 3.7962 3.8840 4.2797 4.2775 3.9463 3.9191 3.7897 3.8673 4.1151 3.9510 3.8298 3.6899 3.5201 3.9409 4.0355 3.6074 3.9672 3.9608 4.1554 3.9148 3.9053 3.8622 1.0271 1.0024 1.0190 1.0104 1.0094 1.0080 0.9931 1.0127 0.9949 1.0016 1.0516 1.0217 1.0063 1.0040 1.0030 1.0013 0.9908 1.0203 1.0134 1.0009 1.0013 1.0329 0.9940 0.9970 0.9942 1.0096 0.9926 0.9868
dispcorr: -0.031906254 hartree
energy: -1459.143322570796
dipole: 34.39663 -34.09544 0.30118 -4.60801 5.78284 1.17483 4.93624 -4.73972 0.19653
magnitude: 1.22864 au
magnitude: 3.12296 debye
