program: Orca
programVersion: 5.0.4
elementType: O O O O O O C C C C C C C C C C C C C C C C C C C C C C C C C C H H H H H H H H H H H H H H H H H H H H H H H H H H H H
charge: 0
multiplicity: 1
keywords: wb97x-d3
keywords: def2-TZVPP
keywords: def2/J RIJCOSX
keywords: DEFGRID2
keywords: scfconv7
keywords: smallprint printgap noloewdin
keywords: NOSOSCF
formula: C26H28O6
InChI: InChI=1/C26H28O6/c1-5-6-10-21-17(2)20-13-12-19(14-24(20)32-26(21)28)31-15-18-9-7-8-11-22(18)23(16-29-3)25(27)30-4/h7-9,11-14,16H,5-6,10,15H2,1-4H3
60 atoms
O  1.520425 -0.376231 0.82675
O  -1.278446 1.91317 -2.223545
O  2.695191 -1.51713 2.272587
O  -1.847117 -1.909833 0.771921
O  -5.305747 -0.715187 -2.104754
O  -2.716447 -3.485627 -0.555484
C  5.102337 -0.109806 1.874457
C  3.829569 0.240691 1.159731
C  5.914822 -1.157269 1.107929
C  3.705527 1.223553 0.233717
C  2.42888 1.440222 -0.41259
C  7.169771 -1.620434 1.840049
C  1.367993 0.604288 -0.081874
C  2.687521 -0.614764 1.480339
C  4.843828 2.110607 -0.165081
C  2.171324 2.438871 -1.362091
C  0.107756 0.721387 -0.649837
C  -0.109603 1.712594 -1.592471
C  0.93396 2.580535 -1.942417
C  8.195707 -0.518649 2.070338
C  -2.346739 1.01506 -1.996173
C  -2.987746 1.169065 -0.639291
C  -3.574053 0.076593 0.003379
C  -3.013943 2.417539 -0.02564
C  -4.157965 0.257686 1.254324
C  -3.601162 -1.273746 -0.608223
C  -3.600571 2.58498 1.216395
C  -4.173436 1.49986 1.862176
C  -2.700089 -2.35117 -0.148141
C  -4.462158 -1.598567 -1.582562
C  -0.903837 -2.847534 1.284475
C  -6.233971 -1.218863 -3.045269
H  5.69917 0.787045 2.043483
H  4.861287 -0.502456 2.863583
H  6.189414 -0.755491 0.126536
H  5.275002 -2.021663 0.915492
H  6.885004 -2.064124 2.798428
H  7.631859 -2.425047 1.262487
H  4.630471 3.151272 0.08679
H  5.778863 1.83822 0.314325
H  5.005065 2.067872 -1.243375
H  2.959692 3.119723 -1.652958
H  -0.665873 0.046074 -0.315132
H  0.754242 3.353993 -2.676716
H  9.102883 -0.913896 2.5276
H  7.81882 0.262411 2.731644
H  8.483727 -0.044257 1.129837
H  -3.073341 1.241087 -2.778996
H  -2.01858 -0.017378 -2.156201
H  -2.562156 3.268186 -0.519199
H  -4.607347 -0.592457 1.751536
H  -3.607552 3.561835 1.68162
H  -4.63028 1.620513 2.835449
H  -4.478296 -2.610494 -1.982953
H  -0.273531 -2.298417 1.976234
H  -1.40404 -3.665176 1.803625
H  -0.283947 -3.263338 0.490653
H  -5.734641 -1.706751 -3.886535
H  -6.926809 -1.927411 -2.585445
H  -6.799801 -0.369535 -3.41927
totalener: -1459.10870997 hartree
nucrepener: 3218.54826349 hartree
electener: -4677.65697346 hartree
oneelecener: -8387.66715483 hartree
twoeener: 3710.01018137 hartree
kineticenergy: 1452.91305341 hartree
xcener: -140.272823824117 hartree
chargesum: 0.0000000
charge: -0.230126 -0.297081 -0.361873 -0.271467 -0.259316 -0.389197 -0.130809 0.035708 -0.126147 -0.015977 -0.019932 -0.110123 0.027327 0.315473 -0.306662 -0.082168 -0.061862 0.295273 -0.236680 -0.266222 0.075498 -0.103404 0.109315 -0.118793 -0.161265 -0.300328 -0.120105 -0.130517 0.448829 0.250997 -0.140308 -0.136681 0.080719 0.101115 0.067659 0.091925 0.062911 0.066667 0.110665 0.088151 0.104570 0.124712 0.082052 0.115731 0.089740 0.074800 0.073920 0.109955 0.107014 0.119254 0.111760 0.124037 0.123445 0.105286 0.127435 0.113632 0.109317 0.101838 0.113349 0.116960
qa: -0.2301 -0.2971 -0.3619 -0.2715 -0.2593 -0.3892 -0.1308 0.0357 -0.1261 -0.0160 -0.0199 -0.1101 0.0273 0.3155 -0.3067 -0.0822 -0.0619 0.2953 -0.2367 -0.2662 0.0755 -0.1034 0.1093 -0.1188 -0.1613 -0.3003 -0.1201 -0.1305 0.4488 0.2510 -0.1403 -0.1367 0.0807 0.1011 0.0677 0.0919 0.0629 0.0667 0.1107 0.0882 0.1046 0.1247 0.0821 0.1157 0.0897 0.0748 0.0739 0.1100 0.1070 0.1193 0.1118 0.1240 0.1234 0.1053 0.1274 0.1136 0.1093 0.1018 0.1133 0.1170
va: 2.2278 2.1144 2.1519 2.1147 2.1190 2.1306 3.8358 3.4996 3.8621 3.7031 3.7867 3.8859 4.2807 4.2978 3.9477 3.9216 3.7960 3.8354 4.1141 3.9286 3.7988 3.7200 3.5194 3.9372 4.0506 3.6384 3.9642 3.9671 4.1444 3.9399 3.8685 3.8948 0.9999 1.0266 1.0092 1.0212 1.0098 1.0087 0.9946 1.0130 0.9936 1.0020 1.0755 1.0218 1.0079 1.0006 1.0021 0.9920 1.0019 1.0204 1.0135 1.0008 1.0014 1.0321 1.0060 0.9976 0.9995 0.9864 0.9853 0.9964
dispcorr: -0.032001009 hartree
energy: -1459.140710981314
dipole: 31.64895 -32.17103 -0.52209 -1.32987 2.55657 1.22669 3.75630 -4.99248 -1.23618
magnitude: 1.81810 au
magnitude: 4.62125 debye
