program: Orca
programVersion: 5.0.4
elementType: O O O O O O C C C C C C C C C C C C C C C C C C C C C C C C C C H H H H H H H H H H H H H H H H H H H H H H H H H H H H
charge: 0
multiplicity: 1
keywords: wb97x-d3
keywords: def2-TZVPP
keywords: def2/J RIJCOSX
keywords: DEFGRID2
keywords: scfconv7
keywords: smallprint printgap noloewdin
keywords: NOSOSCF
formula: C26H28O6
InChI: InChI=1/C26H28O6/c1-5-6-10-21-17(2)20-13-12-19(14-24(20)32-26(21)28)31-15-18-9-7-8-11-22(18)23(16-29-3)25(27)30-4/h7-9,11-14,16H,5-6,10,15H2,1-4H3
60 atoms
O  1.661494 -0.479666 -0.360505
O  -1.769412 2.366052 1.22408
O  3.14309 -1.902592 -1.10319
O  -5.243409 -0.603825 1.060239
O  -1.355517 -2.169683 -0.959275
O  -4.460879 -2.603159 1.681271
C  5.371856 -0.216938 -0.756847
C  3.972879 0.210925 -0.42165
C  6.05135 -0.939919 0.406508
C  3.634346 1.407167 0.121004
C  2.247287 1.69194 0.41664
C  7.45087 -1.429913 0.060939
C  1.297761 0.711592 0.151034
C  2.946123 -0.801485 -0.662272
C  4.641426 2.467599 0.440287
C  1.774677 2.897149 0.955839
C  -0.056575 0.888078 0.390971
C  -0.490277 2.08839 0.929775
C  0.440056 3.099286 1.21019
C  8.110489 -2.175056 1.211827
C  -2.751515 1.362741 1.03778
C  -3.083994 1.119975 -0.412842
C  -3.36616 -0.164014 -0.887718
C  -3.122588 2.197817 -1.290932
C  -3.667625 -0.333916 -2.236855
C  -3.329853 -1.359115 -0.010598
C  -3.424957 2.015103 -2.629328
C  -3.696702 0.742263 -3.106135
C  -4.376392 -1.617066 0.992625
C  -2.363366 -2.288799 -0.112178
C  -6.308696 -0.737682 1.987162
C  -0.362546 -3.184747 -0.926238
H  5.342897 -0.883281 -1.620304
H  5.973901 0.641057 -1.061913
H  5.433266 -1.789956 0.708076
H  6.097502 -0.272716 1.273828
H  7.397584 -2.081721 -0.815788
H  8.074468 -0.579551 -0.232542
H  4.442191 3.376974 -0.129786
H  4.594085 2.734067 1.497411
H  5.660423 2.160211 0.228305
H  2.470367 3.693398 1.183188
H  -0.729371 0.088345 0.122435
H  0.094003 4.03327 1.631645
H  8.203141 -1.53961 2.094149
H  9.110799 -2.518191 0.947256
H  7.527363 -3.051009 1.499839
H  -2.443952 0.435045 1.531206
H  -3.63095 1.731803 1.567342
H  -2.900559 3.19287 -0.926873
H  -3.882902 -1.329114 -2.603772
H  -3.445888 2.865438 -3.298145
H  -3.929672 0.587631 -4.151297
H  -2.383374 -3.166816 0.531216
H  -6.912098 0.159914 1.880321
H  -6.922057 -1.613317 1.773281
H  -5.945747 -0.811954 3.013063
H  0.467791 -2.843995 -1.536165
H  0.006075 -3.350165 0.087988
H  -0.751594 -4.12293 -1.327529
totalener: -1459.11151499 hartree
nucrepener: 3221.05571122 hartree
electener: -4680.16722622 hartree
oneelecener: -8392.43950523 hartree
twoeener: 3712.27227901 hartree
kineticenergy: 1452.91255382 hartree
xcener: -140.272783335029 hartree
chargesum: 0.0000000
charge: -0.230835 -0.294511 -0.373497 -0.271340 -0.258832 -0.390631 -0.125045 0.042192 -0.121970 -0.008524 -0.020895 -0.094809 0.023039 0.313556 -0.311785 -0.077681 -0.042330 0.284581 -0.237443 -0.253851 0.060824 -0.114283 0.112600 -0.119497 -0.168313 -0.264711 -0.127783 -0.124291 0.441851 0.243234 -0.143726 -0.143155 0.097538 0.081943 0.083397 0.060795 0.061832 0.050553 0.110099 0.105922 0.091655 0.124782 0.078405 0.116086 0.070097 0.084376 0.076521 0.111394 0.112709 0.118771 0.114411 0.124120 0.123206 0.109144 0.113955 0.114060 0.109370 0.131160 0.104075 0.117483
qa: -0.2308 -0.2945 -0.3735 -0.2713 -0.2588 -0.3906 -0.1250 0.0422 -0.1220 -0.0085 -0.0209 -0.0948 0.0230 0.3136 -0.3118 -0.0777 -0.0423 0.2846 -0.2374 -0.2539 0.0608 -0.1143 0.1126 -0.1195 -0.1683 -0.2647 -0.1278 -0.1243 0.4419 0.2432 -0.1437 -0.1432 0.0975 0.0819 0.0834 0.0608 0.0618 0.0506 0.1101 0.1059 0.0917 0.1248 0.0784 0.1161 0.0701 0.0844 0.0765 0.1114 0.1127 0.1188 0.1144 0.1241 0.1232 0.1091 0.1140 0.1141 0.1094 0.1312 0.1041 0.1175
va: 2.2284 2.1170 2.1410 2.1133 2.1262 2.1276 3.8429 3.5075 3.8404 3.6925 3.7958 3.8830 4.2792 4.2785 3.9463 3.9187 3.7895 3.8677 4.1121 3.9513 3.8252 3.6969 3.5179 3.9370 4.0380 3.6093 3.9670 3.9606 4.1551 3.9195 3.9061 3.8602 1.0272 1.0022 1.0190 1.0105 1.0093 1.0080 0.9949 0.9930 1.0126 1.0016 1.0517 1.0218 1.0030 1.0062 1.0039 1.0008 0.9910 1.0200 1.0132 1.0009 1.0012 1.0326 0.9940 0.9969 0.9940 1.0104 0.9917 0.9867
dispcorr: -0.031884846 hartree
energy: -1459.143399839229
dipole: 34.64274 -34.33741 0.30533 -4.15146 5.34337 1.19191 4.20266 -4.01590 0.18676
magnitude: 1.24449 au
magnitude: 3.16324 debye
