program: Orca
programVersion: 5.0.4
elementType: O O O O O O C C C C C C C C C C C C C C C C C C C C C C C C C C H H H H H H H H H H H H H H H H H H H H H H H H H H H H
charge: 0
multiplicity: 1
keywords: wb97x-d3
keywords: def2-TZVPP
keywords: def2/J RIJCOSX
keywords: DEFGRID2
keywords: scfconv7
keywords: smallprint printgap noloewdin
keywords: NOSOSCF
formula: C26H28O6
InChI: InChI=1/C26H28O6/c1-5-6-10-21-17(2)20-13-12-19(14-24(20)32-26(21)28)31-15-18-9-7-8-11-22(18)23(16-29-3)25(27)30-4/h7-9,11-14,16H,5-6,10,15H2,1-4H3
60 atoms
O  1.746907 -0.638548 0.432019
O  -1.75887 2.469712 1.091942
O  3.251008 -2.180399 0.090493
O  -5.186556 -0.498542 0.882823
O  -1.149651 -2.309191 -0.558372
O  -4.493666 -2.409539 1.813195
C  5.500143 -0.437447 0.364211
C  4.070349 0.008644 0.511911
C  6.126587 -0.054662 -0.982994
C  3.702338 1.285158 0.792606
C  2.30103 1.629446 0.881752
C  5.53135 -0.754758 -2.201131
C  1.359935 0.625206 0.685799
C  3.047876 -1.018328 0.323949
C  4.69716 2.381815 1.014089
C  1.806059 2.916058 1.139735
C  -0.00739 0.851883 0.736605
C  -0.463884 2.133025 1.000305
C  0.457944 3.170547 1.200695
C  5.823965 -2.247905 -2.259152
C  -2.745619 1.470079 0.906519
C  -2.894937 1.050572 -0.53444
C  -3.114033 -0.282973 -0.89123
C  -2.834245 2.022979 -1.527381
C  -3.256437 -0.606506 -2.238839
C  -3.182244 -1.373161 0.110997
C  -2.979201 1.688222 -2.862364
C  -3.190078 0.365844 -3.220814
C  -4.328786 -1.512774 1.024316
C  -2.230151 -2.319432 0.202383
C  -6.337025 -0.517286 1.712859
C  -0.176777 -3.313201 -0.306019
H  6.101635 -0.005356 1.167226
H  5.55775 -1.516076 0.506312
H  7.198705 -0.271482 -0.93879
H  6.044013 1.027599 -1.119232
H  4.451432 -0.586716 -2.238883
H  5.935293 -0.276858 -3.097618
H  4.522004 2.872671 1.972667
H  5.723642 2.029855 1.007954
H  4.607134 3.146496 0.240217
H  2.494279 3.735581 1.295096
H  -0.670085 0.023142 0.541214
H  0.09367 4.168354 1.403599
H  6.898609 -2.438592 -2.229057
H  5.440759 -2.684468 -3.181719
H  5.361175 -2.784981 -1.432958
H  -2.542158 0.61029 1.552551
H  -3.671069 1.925343 1.26138
H  -2.661288 3.056179 -1.254072
H  -3.426083 -1.639378 -2.51396
H  -2.927361 2.458566 -3.620458
H  -3.303342 0.092102 -4.26144
H  -2.329365 -3.121231 0.932209
H  -6.941876 -1.408629 1.544196
H  -6.073984 -0.473401 2.770564
H  -6.912426 0.365146 1.445685
H  -0.578987 -4.307352 -0.513632
H  0.663085 -3.117045 -0.964381
H  0.183614 -3.272128 0.722612
totalener: -1459.10921895 hartree
nucrepener: 3272.51236772 hartree
electener: -4731.62158667 hartree
oneelecener: -8495.40784591 hartree
twoeener: 3763.78625924 hartree
kineticenergy: 1452.90147276 hartree
xcener: -140.273234344181 hartree
chargesum: 0.0000000
charge: -0.229519 -0.293073 -0.378901 -0.271773 -0.256392 -0.390126 -0.164902 0.028843 -0.142632 0.016475 -0.024643 -0.112819 0.039015 0.328776 -0.329386 -0.080856 -0.037997 0.279015 -0.234154 -0.245074 0.061064 -0.125134 0.118451 -0.118851 -0.171971 -0.250496 -0.130404 -0.123219 0.436055 0.240532 -0.143586 -0.141555 0.092028 0.108878 0.072801 0.076045 0.064524 0.068740 0.106460 0.091862 0.115732 0.125350 0.072528 0.116607 0.067834 0.078514 0.089912 0.111733 0.112100 0.117711 0.113899 0.124101 0.123535 0.108525 0.114554 0.109625 0.113953 0.117417 0.123416 0.110846
qa: -0.2295 -0.2931 -0.3789 -0.2718 -0.2564 -0.3901 -0.1649 0.0288 -0.1426 0.0165 -0.0246 -0.1128 0.0390 0.3288 -0.3294 -0.0809 -0.0380 0.2790 -0.2342 -0.2451 0.0611 -0.1251 0.1185 -0.1189 -0.1720 -0.2505 -0.1304 -0.1232 0.4361 0.2405 -0.1436 -0.1416 0.0920 0.1089 0.0728 0.0760 0.0645 0.0687 0.1065 0.0919 0.1157 0.1253 0.0725 0.1166 0.0678 0.0785 0.0899 0.1117 0.1121 0.1177 0.1139 0.1241 0.1235 0.1085 0.1146 0.1096 0.1140 0.1174 0.1234 0.1108
va: 2.2317 2.1183 2.1227 2.1143 2.1300 2.1284 3.8538 3.4515 3.8877 3.6479 3.8042 3.9009 4.2611 4.2367 3.9481 3.9223 3.7964 3.8803 4.1060 3.9248 3.8256 3.7001 3.5110 3.9396 4.0371 3.5936 3.9669 3.9584 4.1563 3.9205 3.9049 3.8646 1.0022 1.0194 1.0108 1.0063 1.0084 1.0057 0.9982 1.0139 0.9898 1.0016 1.0460 1.0217 1.0031 1.0081 1.0146 0.9999 0.9909 1.0198 1.0137 1.0009 1.0011 1.0319 0.9968 0.9941 0.9940 0.9868 1.0066 0.9934
dispcorr: -0.033381632 hartree
energy: -1459.142600578797
dipole: 28.02489 -27.78031 0.24458 -1.99717 3.28493 1.28776 -8.26499 8.18461 -0.08038
magnitude: 1.31324 au
magnitude: 3.33800 debye
