program: Orca
programVersion: 5.0.4
elementType: O O O O O O C C C C C C C C C C C C C C C C C C C C C C C C C C H H H H H H H H H H H H H H H H H H H H H H H H H H H H
charge: 0
multiplicity: 1
keywords: wb97x-d3
keywords: def2-TZVPP
keywords: def2/J RIJCOSX
keywords: DEFGRID2
keywords: scfconv7
keywords: smallprint printgap noloewdin
keywords: NOSOSCF
formula: C26H28O6
InChI: InChI=1/C26H28O6/c1-5-6-10-21-17(2)20-13-12-19(14-24(20)32-26(21)28)31-15-18-9-7-8-11-22(18)23(16-29-3)25(27)30-4/h7-9,11-14,16H,5-6,10,15H2,1-4H3
60 atoms
O  1.492294 -0.269041 0.889468
O  -1.2545 1.718564 -2.412066
O  2.656373 -1.29117 2.430032
O  -1.890128 -1.807571 0.975152
O  -5.128262 -0.970613 -2.259173
O  -2.694537 -3.537343 -0.192684
C  5.015118 0.207554 2.063467
C  3.766779 0.447948 1.264573
C  5.9345 -0.826702 1.41215
C  3.649767 1.356808 0.265165
C  2.396596 1.478475 -0.448306
C  7.18271 -1.105746 2.238626
C  1.346183 0.640327 -0.091535
C  2.645172 -0.431688 1.591796
C  4.772541 2.257814 -0.145114
C  2.150915 2.391649 -1.483493
C  0.102352 0.683872 -0.705713
C  -0.104076 1.593277 -1.729631
C  0.93258 2.454922 -2.114834
C  8.099957 -2.133574 1.592469
C  -2.318114 0.828167 -2.139049
C  -3.006182 1.095657 -0.823876
C  -3.589392 0.056568 -0.094921
C  -3.078777 2.397183 -0.336712
C  -4.219698 0.346102 1.112728
C  -3.562369 -1.34844 -0.565971
C  -3.710484 2.671506 0.863288
C  -4.283007 1.640939 1.593619
C  -2.696636 -2.361821 0.074403
C  -4.326872 -1.78197 -1.577813
C  -0.957638 -2.663723 1.628108
C  -5.88483 -1.568395 -3.294105
H  5.559902 1.141767 2.214651
H  4.738885 -0.141926 3.0591
H  6.222702 -0.482764 0.413028
H  5.378298 -1.75666 1.265358
H  7.732539 -0.172578 2.3974
H  6.885282 -1.452976 3.232272
H  5.002231 2.129052 -1.204113
H  4.50194 3.305457 0.000072
H  5.686346 2.071725 0.410187
H  2.934141 3.066884 -1.800123
H  -0.667699 0.019011 -0.342633
H  0.760786 3.161989 -2.915009
H  7.586683 -3.085612 1.449741
H  8.982067 -2.324369 2.203894
H  8.444843 -1.797116 0.613275
H  -3.020554 0.971806 -2.962131
H  -1.971774 -0.209266 -2.193381
H  -2.62763 3.205493 -0.897419
H  -4.667604 -0.461216 1.677861
H  -3.754296 3.688817 1.229216
H  -4.776453 1.845557 2.534463
H  -4.298378 -2.82902 -1.873247
H  -1.468082 -3.416536 2.228853
H  -0.307517 -3.165711 0.912431
H  -0.355006 -2.025561 2.265968
H  -6.569372 -2.326145 -2.905785
H  -6.466884 -0.777224 -3.759391
H  -5.242575 -2.025366 -4.051447
totalener: -1459.10980865 hartree
nucrepener: 3213.43378083 hartree
electener: -4672.54358948 hartree
oneelecener: -8377.41798459 hartree
twoeener: 3704.87439511 hartree
kineticenergy: 1452.91114651 hartree
xcener: -140.271320507545 hartree
chargesum: -0.0000000
charge: -0.229738 -0.296905 -0.361279 -0.270641 -0.260509 -0.388414 -0.125042 0.037547 -0.123659 -0.008924 -0.021298 -0.093984 0.025919 0.315203 -0.313966 -0.079659 -0.054029 0.291893 -0.237993 -0.253967 0.077913 -0.111528 0.110987 -0.119855 -0.163697 -0.284872 -0.123737 -0.128019 0.445156 0.246097 -0.137347 -0.139934 0.082255 0.098483 0.059074 0.085061 0.049830 0.062414 0.105735 0.111008 0.090456 0.124555 0.077337 0.115851 0.076580 0.084203 0.069494 0.109523 0.106167 0.120139 0.111754 0.124329 0.123802 0.105420 0.114079 0.109213 0.125124 0.112535 0.117228 0.106631
qa: -0.2297 -0.2969 -0.3613 -0.2706 -0.2605 -0.3884 -0.1250 0.0375 -0.1237 -0.0089 -0.0213 -0.0940 0.0259 0.3152 -0.3140 -0.0797 -0.0540 0.2919 -0.2380 -0.2540 0.0779 -0.1115 0.1110 -0.1199 -0.1637 -0.2849 -0.1237 -0.1280 0.4452 0.2461 -0.1373 -0.1399 0.0823 0.0985 0.0591 0.0851 0.0498 0.0624 0.1057 0.1110 0.0905 0.1246 0.0773 0.1159 0.0766 0.0842 0.0695 0.1095 0.1062 0.1201 0.1118 0.1243 0.1238 0.1054 0.1141 0.1092 0.1251 0.1125 0.1172 0.1066
va: 2.2290 2.1146 2.1521 2.1139 2.1191 2.1310 3.8428 3.5057 3.8433 3.6876 3.7840 3.8810 4.2783 4.2911 3.9469 3.9180 3.7912 3.8398 4.1124 3.9518 3.7947 3.7182 3.5301 3.9369 4.0497 3.6327 3.9673 3.9650 4.1467 3.9411 3.8708 3.8920 1.0012 1.0289 1.0105 1.0184 1.0080 1.0096 0.9927 0.9948 1.0124 1.0019 1.0750 1.0220 1.0039 1.0062 1.0031 0.9926 1.0020 1.0203 1.0137 1.0008 1.0012 1.0321 0.9969 1.0004 1.0050 0.9858 0.9967 0.9856
dispcorr: -0.031580347 hartree
energy: -1459.141389001913
dipole: 31.97255 -32.41315 -0.44060 -3.55290 4.74816 1.19526 3.24335 -4.63961 -1.39626
magnitude: 1.89006 au
magnitude: 4.80415 debye
