program: Orca
programVersion: 5.0.4
elementType: O O O O O O C C C C C C C C C C C C C C C C C C C C C C C C C C H H H H H H H H H H H H H H H H H H H H H H H H H H H H
charge: 0
multiplicity: 1
keywords: wb97x-d3
keywords: def2-TZVPP
keywords: def2/J RIJCOSX
keywords: DEFGRID2
keywords: scfconv7
keywords: smallprint printgap noloewdin
keywords: NOSOSCF
formula: C26H28O6
InChI: InChI=1/C26H28O6/c1-5-6-10-21-17(2)20-13-12-19(14-24(20)32-26(21)28)31-15-18-9-7-8-11-22(18)23(16-29-3)25(27)30-4/h7-9,11-14,16H,5-6,10,15H2,1-4H3
60 atoms
O  1.883453 1.340784 -1.32028
O  -2.195399 1.811714 1.031468
O  3.678021 1.04192 -2.534037
O  -4.651344 -0.163766 1.257445
O  -0.470046 -1.683089 -0.113964
O  -3.279018 -1.028928 2.794956
C  5.351638 0.252613 -0.43822
C  3.913663 0.625272 -0.215772
C  5.530634 -1.170374 -0.979444
C  3.264411 0.606231 0.9752
C  1.859154 0.951105 1.026784
C  5.08959 -2.264244 -0.01624
C  1.215915 1.308245 -0.153508
C  3.196112 1.003489 -1.43653
C  3.921745 0.231201 2.267243
C  1.077156 0.921558 2.191018
C  -0.133405 1.631445 -0.207245
C  -0.878133 1.572686 0.957974
C  -0.263035 1.217531 2.166371
C  5.294619 -3.660403 -0.586812
C  -2.929348 2.077059 -0.139373
C  -3.008705 0.956518 -1.149561
C  -2.890543 -0.401825 -0.837014
C  -3.259136 1.332667 -2.46575
C  -3.029072 -1.334935 -1.863388
C  -2.579222 -0.900176 0.521286
C  -3.40493 0.394505 -3.472227
C  -3.288234 -0.951601 -3.167169
C  -3.501642 -0.717359 1.650896
C  -1.418636 -1.515823 0.797228
C  -5.620671 0.07053 2.265374
C  0.697812 -2.363208 0.295455
H  5.788931 0.9526 -1.151465
H  5.926346 0.363745 0.482066
H  6.587757 -1.313184 -1.222574
H  4.99048 -1.266909 -1.924188
H  5.642956 -2.170738 0.923811
H  4.03426 -2.127175 0.239888
H  3.452765 -0.655892 2.698074
H  4.979059 0.015132 2.159561
H  3.820533 1.034598 2.998949
H  1.528011 0.648877 3.135605
H  -0.564629 1.873492 -1.168077
H  -0.862269 1.161565 3.065107
H  6.344344 -3.840748 -0.823177
H  4.725681 -3.797629 -1.507602
H  4.979241 -4.432787 0.115045
H  -3.932968 2.31647 0.215669
H  -2.543656 2.978907 -0.631572
H  -3.333796 2.386922 -2.70907
H  -2.939066 -2.386112 -1.622523
H  -3.59793 0.714511 -4.487436
H  -3.392833 -1.70039 -3.940944
H  -1.219947 -1.874225 1.804836
H  -5.253889 0.759142 3.027433
H  -6.476318 0.511839 1.760627
H  -5.928077 -0.854527 2.753955
H  1.08376 -1.973023 1.240624
H  0.519923 -3.4369 0.397532
H  1.447365 -2.202719 -0.476093
totalener: -1459.10265252 hartree
nucrepener: 3393.71344791 hartree
electener: -4852.81610043 hartree
oneelecener: -8737.50627830 hartree
twoeener: 3884.69017787 hartree
kineticenergy: 1452.93411671 hartree
xcener: -140.283558684585 hartree
chargesum: 0.0000000
charge: -0.207278 -0.290504 -0.337054 -0.274252 -0.250014 -0.400868 -0.141590 -0.001669 -0.125334 -0.041662 -0.099892 -0.077052 0.119974 0.344477 -0.289036 -0.125626 -0.111584 0.319013 -0.213082 -0.260537 0.051858 -0.159658 0.144804 -0.108906 -0.175061 -0.205486 -0.136605 -0.117500 0.448342 0.193020 -0.148557 -0.138963 0.104115 0.089299 0.068723 0.084259 0.055738 0.025751 0.099638 0.090380 0.117537 0.129011 0.110798 0.123299 0.077844 0.077311 0.082559 0.117840 0.104111 0.106572 0.113325 0.125633 0.123491 0.114789 0.111349 0.112887 0.114323 0.090351 0.127459 0.117889
qa: -0.2073 -0.2905 -0.3371 -0.2743 -0.2500 -0.4009 -0.1416 -0.0017 -0.1253 -0.0417 -0.0999 -0.0771 0.1200 0.3445 -0.2890 -0.1256 -0.1116 0.3190 -0.2131 -0.2605 0.0519 -0.1597 0.1448 -0.1089 -0.1751 -0.2055 -0.1366 -0.1175 0.4483 0.1930 -0.1486 -0.1390 0.1041 0.0893 0.0687 0.0843 0.0557 0.0258 0.0996 0.0904 0.1175 0.1290 0.1108 0.1233 0.0778 0.0773 0.0826 0.1178 0.1041 0.1066 0.1133 0.1256 0.1235 0.1148 0.1113 0.1129 0.1143 0.0904 0.1275 0.1179
va: 2.2229 2.1112 2.1785 2.1253 2.1135 2.1144 3.8811 3.3646 3.8488 3.5928 3.6137 3.8684 4.1805 4.3270 3.9385 3.8385 3.9111 3.7749 4.0251 3.9634 3.8177 3.7259 3.4381 3.9347 4.0233 3.6199 3.9905 3.9600 4.1562 3.9249 3.9085 3.8932 1.0219 1.0029 1.0133 1.0195 1.0066 1.0067 0.9931 1.0192 0.9980 1.0003 1.0387 1.0247 1.0044 1.0037 1.0044 0.9872 0.9987 1.0089 1.0151 1.0008 1.0016 1.0319 0.9939 0.9940 0.9968 0.9850 0.9929 0.9930
dispcorr: -0.037613790 hartree
energy: -1459.140266308654
dipole: 24.37725 -24.60094 -0.22369 -17.23015 16.83768 -0.39247 5.09619 -4.09741 0.99878
magnitude: 1.09619 au
magnitude: 2.78630 debye
