program: Gaussian 09
title: 000069361
version: EM64L-G09RevD.01
frameworkgroup: C1[X(C6H13NO)]
method: RPBEPBE
basis: SDD
operation: Freq
keyword: #p
keyword: freq=noraman
keyword: PBEPBE/SDD
title: #p freq=noraman PBEPBE/SDD
converged: YES YES NO NO
title: Mulliken charges:
elementType: O N C C C C C C H H H H H H H H H H H H H
charge: -0.225681 -0.578687 0.261332 -0.523190 -0.728506 -0.720711 0.237062 -0.771211 0.264518 0.217932 0.223162 0.196618 0.255320 0.193615 0.203499 0.258185 0.250214 0.263314 0.232679 0.254893 0.235645
chargesum: 0.00000
title: Mulliken charges with hydrogens summed into heavy atoms:
elementType: O N C C C C C C
charge: -0.225681 -0.065159 0.261332 -0.040741 -0.053406 -0.065413 0.237062 -0.047995
polarizability: 8.38693832e+01 1.46711125e+00 7.55360372e+01 -6.99884784e-01 -8.89482758e-01 6.44831121e+01
1716.lowfreq: -66.0804 -13.6453 -7.1842 -0.0006 0.0005 0.0008 15.9728 67.7759 118.5166
frequency: -65.8136 67.7351 118.4541 176.7981 227.5950 248.7704 277.4722 296.2799 315.9681 327.5166 393.0071 413.7474 461.4440 469.5619 587.8738 681.7249 749.6759 812.6044 844.8097 914.8276 922.3123 943.5549 973.5443 988.4821 1015.5068 1070.4075 1147.7146 1161.8394 1220.1106 1256.0048 1328.0780 1335.0946 1365.0264 1365.6255 1381.2908 1417.2095 1442.8281 1453.2932 1454.7310 1475.8200 1477.0164 1494.0387 1630.8451 1637.2500 2951.1460 2965.0494 2978.8237 2981.7389 3009.6642 3055.7950 3065.4965 3069.0630 3087.9608 3115.1640 3122.0379 3402.2433 3529.9773
redmass: 1.2193 2.1553 3.0636 3.5263 1.0865 1.1369 1.0180 2.8074 2.1185 2.7355 2.7407 1.9766 2.2472 2.3705 3.5545 1.5023 3.6497 1.5983 3.2023 2.0120 1.6075 1.8899 1.3052 1.5651 1.4779 1.5018 1.8114 1.6612 3.1856 1.9893 2.4375 1.8339 1.2475 1.2444 1.2220 1.0839 1.0781 1.0500 1.0517 1.0515 1.0631 1.0649 1.7090 2.1391 1.0629 1.0366 1.0386 1.0375 1.0929 1.0988 1.0963 1.0969 1.0989 1.0988 1.1000 1.0447 1.0957
irintensity: 1.4713 1.2838 2.9570 6.6726 20.8996 20.9345 10.2079 1.5117 1.3153 7.0941 1.1782 9.2271 11.1814 1.9685 12.3035 194.3315 0.8983 1.3308 3.2522 11.4672 3.7894 1.1718 2.8974 0.3238 0.7451 3.6825 28.6616 43.4985 10.5302 16.8136 52.5802 67.6918 39.0277 59.1641 40.3436 9.8293 28.4864 23.7347 0.6346 2.7475 16.9990 12.7393 44.9323 83.0031 24.5808 39.0509 30.4357 4.8108 11.4749 36.8372 14.7402 46.7234 15.3587 10.8825 14.6880 5.4439 0.6748
temp: 298.150 k
press: 1.00000 atm
elementType: 8 7 6 6 6 6 6 6 1 1 1 1 1 1 1 1 1 1 1 1 1
symmnumber: 1
zpe: 476578.2 jmol-1
zpe.correction: 0.181519 hartree
zpe.thermalcorrener: 0.191202 hartree
zpe.thermalcorrenthalpy: 0.192146 hartree
zpe.thermalcorrgfe: 0.147659 hartree
zpe.sumelectzpe: -365.739530 hartree
zpe.sumelectthermal: -365.729848 hartree
zpe.sumelectthermalent: -365.728903 hartree
zpe.sumelectthermalfe: -365.773390 hartree
dipole: 0.4342 -2.2688 0.9233
dipole: 2.4877
quadrupole: -45.2609 -55.1153 -50.1013
quadrupole: 5.8391 1.9296 -2.8690
quadrupole: 4.8983 -4.9561 0.0579 5.8391 1.9296 -2.8690
hfenergy: -365.9210493 hartree
pointgroup: C01 [X(C6H13N1O1)]
dipole: 0.1933324 -0.9151676 0.288059 debye
dipolederiv: -0.6426068 0.0151157 -0.003194 -0.0366064 -0.8625377 -0.0560134 -0.0065408 -0.0539857 -0.3001452 -0.4658467 0.1411953 -0.0042857 0.1753594 -0.5651564 -0.2575827 0.0426292 -0.2565089 -0.4893553 0.4954927 -0.1682144 -0.0109729 -0.0709975 0.3573769 0.1146896 0.0524582 0.0590928 0.3498063 -0.3726007 0.1430341 -0.0068314 0.1889098 -0.1758032 -0.0446526 0.0309436 -0.0625353 0.0698506 -0.0048064 0.0252661 0.0218672 0.0480712 -0.061022 0.0526173 0.0013355 0.0840704 -0.0598972 -0.0424056 0.0329685 -0.037603 0.0439787 -0.070085 -0.0852075 0.0160543 -0.144929 -0.120076 1.1811499 0.0426466 0.0118927 0.0325951 0.9591211 0.0888593 0.0192098 0.0830942 0.0833691 -0.4471316 -0.2221781 -0.0229305 -0.2457744 -0.1640141 -0.0197612 -0.0306704 -0.0150654 0.03645 0.0639036 -0.0119062 -0.0411069 -0.0660132 0.0626912 -0.0740983 -0.0649117 -0.100306 -0.037395 0.0377179 -0.0068644 0.0336547 -0.0472037 -0.0051744 0.1044829 0.0277574 0.143793 -0.0311106 0.0962391 -0.0268545 -0.0317628 -0.0152169 0.0317594 -0.1244329 -0.0197514 -0.0673415 -0.1232257 -0.1700666 -0.1318652 0.0216367 -0.0942484 0.046358 0.0166717 -0.0287532 0.0041637 0.0732346 0.056611 0.1183974 -0.0247964 0.0934673 0.0030947 0.0108578 -0.0187951 -0.0289207 0.1034452 0.0883712 -0.027071 0.0233014 -0.0095905 -0.0425495 0.1585531 0.0117958 0.0920049 -0.1053985 -0.1598858 -0.1229123 -0.0396621 -0.0998568 0.0462664 -0.0231471 0.0108287 -0.0019754 0.0669248 0.047733 0.1237374 0.0568914 0.1059862 -0.0183133 -0.0429694 0.0491117 -0.0103226 0.0882497 0.1608344 0.047784 0.0318832 0.0267107 0.2005172 0.1179009 -0.0173448 0.2191786 0.0356999 -0.0340486 -0.0378748 0.0166818 -0.1444029 0.1400298 0.0572398 -0.0827852 0.0513313 0.2918588 0.0906969 0.0069995 -0.041607 -0.0031711 0.028591 0.1034481 0.0131968 0.1207541 -0.0104693 -0.0678897 0.054579 0.0021904 0.1173637 0.0245554 -0.0061883 0.0057265 -0.00753 0.1191402 0.0885388 0.0040172 0.0447534 0.0006397 0.0642945 -0.0912672 -0.0114951 -0.1080626 -0.0409564 unknown
polarizability: 83.7896784|1.7157335|75.6845057|-0.6140892|0.0138766|64.4143484 unknown
InChI: InChI=1S/C6H13NO/c1-5(8)4-6(2,3)7/h4,7H2,1-3H3
charge 0 multiplicity 1
21 atoms
O  -1.50343 1.283446 0.172681
N  2.186824 -1.148772 -0.136743
C  1.159264 -0.074436 0.030594
C  -0.209677 -0.806264 -0.026171
C  1.314185 0.896027 -1.163658
C  1.322982 0.692834 1.373806
C  -1.490337 0.028155 0.052561
C  -2.794744 -0.762464 -0.030135
H  -0.2391 -1.401727 -0.961899
H  -0.259752 -1.560057 0.790621
H  1.207159 0.350196 -2.118126
H  2.316431 1.366949 -1.148225
H  0.557699 1.694388 -1.11142
H  1.226598 0.001493 2.234273
H  2.325313 1.158884 1.423229
H  0.562588 1.485883 1.476567
H  2.218797 -1.795695 0.663492
H  3.121758 -0.762741 -0.322987
H  -2.862374 -1.487498 0.803276
H  -3.65451 -0.076358 0.013327
H  -2.836975 -1.347643 -0.968064
