program: Orca
programVersion: 5.0.4
elementType: O O O O O O C C C C C C C C C C C C C C C C C C C C C C C C C C H H H H H H H H H H H H H H H H H H H H H H H H H H H H
charge: 0
multiplicity: 1
keywords: wb97x-d3
keywords: def2-TZVPP
keywords: def2/J RIJCOSX
keywords: DEFGRID2
keywords: scfconv7
keywords: smallprint printgap noloewdin
keywords: NOSOSCF
formula: C26H28O6
InChI: InChI=1/C26H28O6/c1-5-6-10-21-17(2)20-13-12-19(14-24(20)32-26(21)28)31-15-18-9-7-8-11-22(18)23(16-29-3)25(27)30-4/h7-9,11-14,16H,5-6,10,15H2,1-4H3
60 atoms
O  1.810209 -0.776888 0.48774
O  -1.637046 2.377556 1.219334
O  3.284607 -2.317356 0.026717
O  -5.180593 -0.452535 0.723965
O  -1.112393 -2.4019 -0.416388
O  -4.634806 -2.394722 1.686215
C  5.554923 -0.632071 0.326746
C  4.143005 -0.164984 0.547063
C  6.172506 -0.223748 -1.01741
C  3.802916 1.100724 0.897693
C  2.408686 1.4637 1.017891
C  5.428058 -0.70255 -2.267535
C  1.448726 0.484333 0.788901
C  3.101293 -1.168097 0.330943
C  4.822616 2.169215 1.139814
C  1.93685 2.749405 1.320394
C  0.086159 0.734179 0.846126
C  -0.34729 2.016137 1.141198
C  0.593215 3.027904 1.382766
C  4.300427 0.211276 -2.734264
C  -2.638405 1.408753 0.962788
C  -2.720092 1.01764 -0.491616
C  -2.972194 -0.300862 -0.880434
C  -2.55081 1.996874 -1.465027
C  -3.03509 -0.604273 -2.238528
C  -3.157487 -1.397513 0.099636
C  -2.618058 1.68222 -2.811054
C  -2.858962 0.373981 -3.20082
C  -4.374004 -1.498221 0.923339
C  -2.255544 -2.3848 0.246584
C  -6.408941 -0.451035 1.434398
C  -0.250485 -3.508071 -0.1941
H  6.195667 -0.263071 1.131494
H  5.581132 -1.718654 0.404958
H  7.187652 -0.629321 -1.032403
H  6.287777 0.864447 -1.061047
H  6.151161 -0.785331 -3.082829
H  5.046172 -1.713072 -2.103729
H  4.663741 2.645037 2.10871
H  5.840044 1.791334 1.121745
H  4.747991 2.95061 0.380871
H  2.640032 3.550309 1.503995
H  -0.588644 -0.077828 0.624617
H  0.247012 4.026151 1.613793
H  4.668314 1.222718 -2.917378
H  3.487805 0.289631 -2.014234
H  3.867542 -0.152491 -3.66655
H  -2.490842 0.531298 1.600772
H  -3.569247 1.881485 1.27867
H  -2.351791 3.018584 -1.167465
H  -3.228443 -1.626215 -2.537837
H  -2.48071 2.457103 -3.553634
H  -2.909211 0.115713 -4.25027
H  -2.445968 -3.194565 0.949046
H  -6.925604 0.457145 1.135377
H  -7.021831 -1.316161 1.180228
H  -6.253857 -0.443021 2.513865
H  -0.627529 -4.400097 -0.698176
H  0.72309 -3.246188 -0.595687
H  -0.136236 -3.718782 0.871197
totalener: -1459.10626156 hartree
nucrepener: 3300.14202434 hartree
electener: -4759.24828589 hartree
oneelecener: -8550.70889469 hartree
twoeener: 3791.46060880 hartree
kineticenergy: 1452.90582783 hartree
xcener: -140.274234441990 hartree
chargesum: 0.0000000
charge: -0.230588 -0.293416 -0.376786 -0.270985 -0.254827 -0.390568 -0.158412 0.022885 -0.138731 -0.017612 0.008938 -0.110514 0.034414 0.331791 -0.319606 -0.074137 -0.040624 0.276973 -0.234303 -0.239300 0.061214 -0.126424 0.120603 -0.115777 -0.171252 -0.264615 -0.129832 -0.123693 0.437179 0.250178 -0.143915 -0.137640 0.086664 0.101939 0.078891 0.058365 0.070898 0.074475 0.106765 0.091736 0.114907 0.125078 0.073335 0.116246 0.068016 0.071040 0.088232 0.111939 0.112491 0.118214 0.113427 0.123756 0.123295 0.105407 0.114241 0.113752 0.109422 0.116405 0.132088 0.098357
qa: -0.2306 -0.2934 -0.3768 -0.2710 -0.2548 -0.3906 -0.1584 0.0229 -0.1387 -0.0176 0.0089 -0.1105 0.0344 0.3318 -0.3196 -0.0741 -0.0406 0.2770 -0.2343 -0.2393 0.0612 -0.1264 0.1206 -0.1158 -0.1713 -0.2646 -0.1298 -0.1237 0.4372 0.2502 -0.1439 -0.1376 0.0867 0.1019 0.0789 0.0584 0.0709 0.0745 0.1068 0.0917 0.1149 0.1251 0.0733 0.1162 0.0680 0.0710 0.0882 0.1119 0.1125 0.1182 0.1134 0.1238 0.1233 0.1054 0.1142 0.1138 0.1094 0.1164 0.1321 0.0984
va: 2.2247 2.1180 2.1321 2.1146 2.1309 2.1281 3.8667 3.4461 3.8953 3.6322 3.7632 3.8711 4.2535 4.2365 3.9393 3.9148 3.7930 3.8782 4.1069 3.9220 3.8234 3.6978 3.5092 3.9355 4.0401 3.6038 3.9680 3.9600 4.1554 3.9142 3.9063 3.8604 1.0006 1.0258 1.0100 1.0057 1.0032 1.0170 0.9983 1.0137 0.9914 1.0012 1.0505 1.0216 1.0050 1.0112 1.0088 0.9989 0.9911 1.0194 1.0135 1.0010 1.0013 1.0344 0.9939 0.9965 0.9944 0.9871 1.0123 0.9921
dispcorr: -0.034192229 hartree
energy: -1459.140453784122
dipole: 24.66322 -24.34573 0.31748 2.51616 -1.34989 1.16627 -9.72431 9.63443 -0.08988
magnitude: 1.21205 au
magnitude: 3.08078 debye
