program: Orca
programVersion: 5.0.4
elementType: O O O O O O C C C C C C C C C C C C C C C C C C C C C C C C C C H H H H H H H H H H H H H H H H H H H H H H H H H H H H
charge: 0
multiplicity: 1
keywords: wb97x-d3
keywords: def2-TZVPP
keywords: def2/J RIJCOSX
keywords: DEFGRID2
keywords: scfconv7
keywords: smallprint printgap noloewdin
keywords: NOSOSCF
formula: C26H28O6
InChI: InChI=1/C26H28O6/c1-5-6-10-21-17(2)20-13-12-19(14-24(20)32-26(21)28)31-15-18-9-7-8-11-22(18)23(16-29-3)25(27)30-4/h7-9,11-14,16H,5-6,10,15H2,1-4H3
60 atoms
O  1.838952 1.240754 -1.234728
O  -2.301929 1.878514 0.966046
O  3.647625 0.806688 -2.387397
O  -4.733616 -0.064044 1.209653
O  -0.579932 -1.672152 -0.144034
O  -3.36886 -0.918454 2.759827
C  5.223767 0.02419 -0.189608
C  3.802554 0.48581 -0.046838
C  5.311028 -1.485201 -0.422147
C  3.114561 0.517098 1.120752
C  1.724651 0.917186 1.120489
C  6.739898 -1.983596 -0.589788
C  1.133339 1.2640 -0.090088
C  3.138288 0.841734 -1.302255
C  3.72361 0.130992 2.432986
C  0.906167 0.943839 2.259184
C  -0.203695 1.62364 -0.197033
C  -0.987612 1.613152 0.943694
C  -0.422912 1.277362 2.182011
C  6.809963 -3.485055 -0.82716
C  -2.993657 2.130641 -0.232556
C  -3.074006 0.989918 -1.220362
C  -2.975754 -0.364222 -0.884071
C  -3.310356 1.346188 -2.54496
C  -3.120707 -1.312794 -1.895658
C  -2.674203 -0.845036 0.482555
C  -3.461923 0.393226 -3.536323
C  -3.366286 -0.948988 -3.207398
C  -3.590896 -0.626523 1.610276
C  -1.52306 -1.475021 0.766676
C  -5.693181 0.208582 2.21701
C  0.582424 -2.356853 0.27449
H  5.687744 0.542177 -1.029782
H  5.808064 0.296119 0.691595
H  4.73004 -1.740785 -1.312999
H  4.837297 -2.010063 0.414971
H  7.209597 -1.457491 -1.42572
H  7.324994 -1.724074 0.298097
H  3.184432 -0.706287 2.880457
H  4.764381 -0.163848 2.345565
H  3.671797 0.958702 3.142636
H  1.318464 0.683104 3.224588
H  -0.598497 1.848829 -1.177567
H  -1.053206 1.259102 3.060691
H  7.83862 -3.824901 -0.947863
H  6.262642 -3.767508 -1.727801
H  6.376537 -4.039325 0.007128
H  -4.001448 2.4013 0.086621
H  -2.572928 3.011475 -0.734071
H  -3.370079 2.396977 -2.806775
H  -3.046469 -2.36081 -1.636364
H  -3.643749 0.698592 -4.558087
H  -3.476449 -1.709693 -3.968671
H  -1.327707 -1.820216 1.779504
H  -5.310874 0.908469 2.960992
H  -6.544641 0.651984 1.707065
H  -6.0125 -0.699959 2.728537
H  1.325704 -2.231834 -0.509368
H  0.984033 -1.942467 1.202376
H  0.389819 -3.424013 0.41225
totalener: -1459.10348487 hartree
nucrepener: 3359.98728523 hartree
electener: -4819.09077009 hartree
oneelecener: -8670.11294307 hartree
twoeener: 3851.02217298 hartree
kineticenergy: 1452.93594053 hartree
xcener: -140.282112420385 hartree
chargesum: 0.0000000
charge: -0.207394 -0.291871 -0.335734 -0.273515 -0.251037 -0.401146 -0.122231 -0.009768 -0.127544 0.003848 -0.145099 -0.095205 0.130592 0.333925 -0.298687 -0.105649 -0.115325 0.321147 -0.218641 -0.253616 0.051419 -0.162241 0.145191 -0.107000 -0.175569 -0.201068 -0.138013 -0.117116 0.447778 0.194398 -0.148585 -0.144793 0.100307 0.082856 0.084311 0.054011 0.063503 0.050841 0.097459 0.094391 0.114284 0.128442 0.111466 0.121883 0.085992 0.076518 0.068625 0.118234 0.104696 0.105714 0.113455 0.125346 0.123341 0.115083 0.111200 0.112751 0.114272 0.121073 0.090111 0.128382
qa: -0.2074 -0.2919 -0.3357 -0.2735 -0.2510 -0.4011 -0.1222 -0.0098 -0.1275 0.0038 -0.1451 -0.0952 0.1306 0.3339 -0.2987 -0.1056 -0.1153 0.3211 -0.2186 -0.2536 0.0514 -0.1622 0.1452 -0.1070 -0.1756 -0.2011 -0.1380 -0.1171 0.4478 0.1944 -0.1486 -0.1448 0.1003 0.0829 0.0843 0.0540 0.0635 0.0508 0.0975 0.0944 0.1143 0.1284 0.1115 0.1219 0.0860 0.0765 0.0686 0.1182 0.1047 0.1057 0.1135 0.1253 0.1233 0.1151 0.1112 0.1128 0.1143 0.1211 0.0901 0.1284
va: 2.2219 2.1080 2.1800 2.1265 2.1131 2.1135 3.8557 3.4395 3.8492 3.6144 3.6365 3.8901 4.1618 4.3400 3.9497 3.8431 3.9110 3.7698 4.0382 3.9493 3.8172 3.7257 3.4375 3.9367 4.0232 3.6112 3.9912 3.9595 4.1562 3.9204 3.9091 3.8908 1.0284 1.0019 1.0177 1.0095 1.0096 1.0080 0.9940 1.0126 0.9960 1.0002 1.0378 1.0262 1.0065 1.0039 1.0030 0.9869 0.9984 1.0090 1.0149 1.0009 1.0016 1.0323 0.9940 0.9941 0.9968 0.9950 0.9859 0.9920
dispcorr: -0.036401518 hartree
energy: -1459.139886384899
dipole: 28.72217 -28.97257 -0.25040 -16.84407 16.49576 -0.34831 4.65706 -3.66426 0.99280
magnitude: 1.08151 au
magnitude: 2.74897 debye
