program: Orca
programVersion: 5.0.4
elementType: O O O O O O C C C C C C C C C C C C C C C C C C C C C C C C C C H H H H H H H H H H H H H H H H H H H H H H H H H H H H
charge: 0
multiplicity: 1
keywords: wb97x-d3
keywords: def2-TZVPP
keywords: def2/J RIJCOSX
keywords: DEFGRID2
keywords: scfconv7
keywords: smallprint printgap noloewdin
keywords: NOSOSCF
formula: C26H28O6
InChI: InChI=1/C26H28O6/c1-5-6-10-21-17(2)20-13-12-19(14-24(20)32-26(21)28)31-15-18-9-7-8-11-22(18)23(16-29-3)25(27)30-4/h7-9,11-14,16H,5-6,10,15H2,1-4H3
60 atoms
O  1.73471 -0.731148 0.609411
O  -1.736192 2.432693 1.170995
O  3.222845 -2.283247 0.236845
O  -5.250719 -0.438708 0.651407
O  -1.142744 -2.389156 -0.335419
O  -4.700162 -2.330454 1.706936
C  5.47972 -0.563401 0.434689
C  4.062691 -0.097477 0.62576
C  6.046975 -0.237881 -0.951373
C  3.712282 1.185987 0.892957
C  2.315302 1.542416 1.001324
C  5.267895 -0.848075 -2.10963
C  1.363474 0.542341 0.837341
C  3.029356 -1.119898 0.471325
C  4.72167 2.276833 1.071351
C  1.834444 2.839139 1.233962
C  -0.000908 0.784131 0.888133
C  -0.443611 2.077611 1.110147
C  0.488907 3.109343 1.289117
C  5.922982 -0.564627 -3.45372
C  -2.728371 1.453899 0.916237
C  -2.768043 1.023607 -0.52879
C  -2.997751 -0.306535 -0.890136
C  -2.579634 1.979246 -1.522162
C  -3.019556 -0.64525 -2.24117
C  -3.200382 -1.378373 0.11362
C  -2.604572 1.629417 -2.860741
C  -2.82339 0.30932 -3.223001
C  -4.433972 -1.462531 0.913476
C  -2.298705 -2.358641 0.30426
C  -6.494977 -0.424986 1.333335
C  -0.278993 -3.482153 -0.061794
H  6.124202 -0.12221 1.19829
H  5.524432 -1.640709 0.593299
H  7.082802 -0.589801 -0.988342
H  6.092848 0.848223 -1.085617
H  5.173615 -1.926355 -1.960937
H  4.247965 -0.454484 -2.116336
H  5.744129 1.913602 1.045539
H  4.620068 3.029168 0.286831
H  4.575096 2.785813 2.025395
H  2.531791 3.655082 1.36655
H  -0.670309 -0.045079 0.720483
H  0.134651 4.116092 1.464283
H  6.929129 -0.984534 -3.502345
H  6.007148 0.508153 -3.636983
H  5.348729 -0.993148 -4.275189
H  -2.596997 0.595178 1.582518
H  -3.6682 1.932809 1.193831
H  -2.397507 3.009944 -1.24536
H  -3.195728 -1.676205 -2.519343
H  -2.451907 2.386043 -3.619023
H  -2.84118 0.023849 -4.26645
H  -2.499424 -3.148711 1.025989
H  -7.088978 -1.310283 1.105024
H  -6.364848 -0.365776 2.414483
H  -7.01809 0.460499 0.98183
H  0.69539 -3.235037 -0.470657
H  -0.16726 -3.645512 1.011937
H  -0.651404 -4.396448 -0.528234
totalener: -1459.10983024 hartree
nucrepener: 3272.08526092 hartree
electener: -4731.19509117 hartree
oneelecener: -8494.57640048 hartree
twoeener: 3763.38130931 hartree
kineticenergy: 1452.91056616 hartree
xcener: -140.274257257138 hartree
chargesum: -0.0000000
charge: -0.229746 -0.293212 -0.374290 -0.270728 -0.253757 -0.390509 -0.138493 0.016526 -0.146674 0.013433 -0.021555 -0.074850 0.048646 0.328308 -0.324666 -0.079823 -0.044561 0.272323 -0.229407 -0.259322 0.058867 -0.130381 0.123096 -0.113916 -0.172922 -0.261454 -0.130710 -0.123139 0.435457 0.249396 -0.143664 -0.139625 0.088877 0.102500 0.070225 0.058962 0.072824 0.057140 0.091992 0.114620 0.106515 0.125247 0.073765 0.116342 0.072717 0.069316 0.086492 0.112023 0.112069 0.118130 0.113427 0.123729 0.123132 0.104958 0.113695 0.109424 0.114333 0.131578 0.100365 0.116954
qa: -0.2297 -0.2932 -0.3743 -0.2707 -0.2538 -0.3905 -0.1385 0.0165 -0.1467 0.0134 -0.0216 -0.0748 0.0486 0.3283 -0.3247 -0.0798 -0.0446 0.2723 -0.2294 -0.2593 0.0589 -0.1304 0.1231 -0.1139 -0.1729 -0.2615 -0.1307 -0.1231 0.4355 0.2494 -0.1437 -0.1396 0.0889 0.1025 0.0702 0.0590 0.0728 0.0571 0.0920 0.1146 0.1065 0.1252 0.0738 0.1163 0.0727 0.0693 0.0865 0.1120 0.1121 0.1181 0.1134 0.1237 0.1231 0.1050 0.1137 0.1094 0.1143 0.1316 0.1004 0.1170
va: 2.2296 2.1175 2.1355 2.1150 2.1320 2.1281 3.8582 3.4656 3.8944 3.6479 3.7959 3.8536 4.2530 4.2521 3.9440 3.9202 3.7890 3.8806 4.0988 3.9550 3.8260 3.7017 3.5048 3.9353 4.0399 3.5973 3.9680 3.9592 4.1570 3.9158 3.9061 3.8615 1.0005 1.0283 1.0133 1.0050 1.0132 1.0101 1.0136 0.9906 0.9978 1.0016 1.0480 1.0216 1.0035 1.0023 1.0054 0.9979 0.9914 1.0192 1.0137 1.0009 1.0013 1.0344 0.9965 0.9943 0.9939 1.0113 0.9920 0.9869
dispcorr: -0.032921345 hartree
energy: -1459.142751589161
dipole: 27.63159 -27.34630 0.28529 0.83304 0.34191 1.17494 -11.35011 11.18602 -0.16409
magnitude: 1.22017 au
magnitude: 3.10142 debye
