program: Gaussian 09
title: 000069359
version: EM64L-G09RevD.01
frameworkgroup: C1[X(C2H5ClO3S)]
method: RPBEPBE
basis: SDD
operation: Freq
keyword: #p
keyword: freq=noraman
keyword: PBEPBE/SDD
title: #p freq=noraman PBEPBE/SDD
converged: YES YES NO NO
title: Mulliken charges:
elementType: Cl S O O O C C H H H H H
charge: -0.162239 1.074995 -0.362947 -0.442076 -0.426347 -0.248199 -0.646420 0.247283 0.247629 0.226638 0.244362 0.247320
chargesum: 0.00000
title: Mulliken charges with hydrogens summed into heavy atoms:
elementType: Cl S O O O C C
charge: -0.162239 1.074995 -0.362947 -0.442076 -0.426347 0.246713 0.071900
polarizability: 9.21230142e+01 -2.23472608e+00 8.09520513e+01 2.92150291e+00 1.74132652e-01 5.77241287e+01
1716.lowfreq: -0.0009 0.0002 0.0022 7.6188 12.0767 13.5272 55.1552 71.5809 119.6738
frequency: 55.0408 71.5046 119.6675 174.7349 181.4859 232.0988 244.8449 261.2852 313.4117 402.4168 412.5324 571.1536 801.9781 824.9714 860.7355 988.1806 997.9858 1091.6852 1134.0459 1242.5194 1339.4414 1389.7945 1448.8934 1475.7731 1485.3988 2998.0987 3002.6396 3075.2685 3097.7484 3124.0473
redmass: 3.9256 2.0775 6.2858 8.5838 7.5749 1.7804 3.8143 4.6684 6.0554 9.1724 20.8375 9.3989 3.4786 1.0874 16.2476 3.7538 5.4065 2.2573 1.4047 1.1437 1.2550 1.1951 1.0398 1.0517 1.0754 1.0406 1.0509 1.1093 1.0968 1.1029
irintensity: 0.0982 2.6691 2.0412 0.8497 1.9611 0.6731 0.1178 5.3889 9.6858 40.7112 88.4572 75.8506 14.4423 6.4406 76.2613 62.3480 22.0995 49.8232 7.5754 1.0518 3.9668 9.6991 15.3343 13.6455 23.1228 7.7244 16.6109 6.2944 13.7535 21.1407
temp: 298.150 k
press: 1.00000 atm
elementType: 17 16 8 8 8 6 6 1 1 1 1 1
symmnumber: 1
zpe: 199892.3 jmol-1
zpe.correction: 0.076135 hartree
zpe.thermalcorrener: 0.085517 hartree
zpe.thermalcorrenthalpy: 0.086461 hartree
zpe.thermalcorrgfe: 0.040535 hartree
zpe.sumelectzpe: -1162.240903 hartree
zpe.sumelectthermal: -1162.231521 hartree
zpe.sumelectthermalent: -1162.230577 hartree
zpe.sumelectthermalfe: -1162.276503 hartree
dipole: 4.2642 1.1204 0.7987
dipole: 4.4807
quadrupole: -50.3453 -58.4811 -60.7337
quadrupole: 0.8749 1.1647 -0.2752
quadrupole: 6.1747 -1.9610 -4.2137 0.8749 1.1647 -0.2752
hfenergy: -1162.3170375 hartree
pointgroup: C01 [X(C2H5Cl1O3S1)]
dipole: 1.714049 0.0427468 0.4097008 debye
dipolederiv: -0.3042629 0.0535865 0.0632821 0.1404978 -0.3734087 -0.2220312 0.2295856 -0.2264196 -0.5266227 1.5945779 -0.0632139 -0.0194662 0.075659 1.4197403 0.275438 -0.2339697 0.2623752 1.5097351 -0.6920888 0.0509132 -0.0928576 -0.0209043 -0.379752 -0.0093568 -0.0138149 -0.0087175 -0.464154 -0.4789045 0.0333651 -0.0142141 -0.103741 -0.605247 -0.0510527 0.0239318 0.0273265 -0.4088337 -0.5345239 -0.0242622 -0.0568763 -0.0215736 -0.3976773 0.0168417 -0.1271561 -0.040308 -0.5305846 0.3893329 -0.0479164 0.0965945 -0.3102067 0.2448534 0.0176359 0.4977118 0.0383951 0.2852375 -0.1166189 -0.0454761 0.0057692 0.1421592 0.066913 0.012996 -0.349126 -0.0144545 0.0539073 -0.002493 0.0387249 0.0790208 0.0757229 0.0500013 -0.0737177 -0.0514082 -0.0419041 -0.039937 0.0013841 -0.0479963 -0.007406 0.0311352 -0.0897398 0.0512353 -0.0748871 0.0039476 0.0636246 -0.0875698 0.0064832 -0.082652 -0.0219406 0.1116051 0.0388919 -0.0329368 0.0417675 0.0024592 0.1016967 0.0027643 0.0259311 0.01946 0.0485481 -0.093672 0.0949885 -0.0765158 -0.0432907 0.1294702 0.0430277 0.0028745 -0.0062677 -0.0958363 0.0367915 0.0370811 0.0345076 0.098459 unknown
polarizability: 92.1360517|-1.9422083|64.705684|-1.9799262|10.9112466|73.9574586 unknown
InChI: InChI=1S/C2H5O3S.Cl/c1-2-5-6(3)4;/h2H2,1H3;
charge 0 multiplicity 1
12 atoms
Cl -1.549616 0.93963 1.500989
S  -0.976304 -0.420547 -0.411762
O  0.721388 0.197415 -0.700988
O  -0.949941 -1.941334 0.106541
O  -1.830366 0.042157 -1.679434
C  1.694364 -0.119529 0.387757
C  3.024921 0.41904 -0.148386
H  1.379729 0.404191 1.309676
H  1.722833 -1.211259 0.555086
H  3.806254 0.242175 0.614168
H  3.316819 -0.096454 -1.077522
H  2.964618 1.502216 -0.342725
