program: Orca
programVersion: 4.2.1
elementType: S O O N C C C C C C C C C C C C H H H H H H H H H H H H H
charge: 0
multiplicity: 1
keywords: wb97x-d3
keywords: def2-TZVPP
keywords: def2/J RIJCOSX GRIDX6 NOFINALGRIDX
keywords: grid4 nofinalgrid
keywords: scfconv7
keywords: smallprint printgap noloewdin
keywords: NOSOSCF
formula: C12H13NO2S
InChI: InChI=1/C12H13NO2S/c1-9-11(16-8-7-15-9)12(14)13-10-5-3-2-4-6-10/h2-6,13H,7-8H2,1H3
29 atoms
S  0.907601 -1.340611 -0.69266
O  2.916925 0.345532 0.996445
O  0.628183 2.075255 -2.163132
N  -1.130545 0.934474 -1.369356
C  1.705684 -1.772187 0.862895
C  3.039529 -1.071295 0.956688
C  1.09705 0.409334 -0.547688
C  2.018793 0.999367 0.237121
C  0.195946 1.217577 -1.401665
C  2.150935 2.474254 0.441466
C  -1.8641 0.215793 -0.410161
C  -1.562167 0.269746 0.947556
C  -2.960978 -0.524503 -0.840434
C  -2.326239 -0.449803 1.853097
C  -3.734026 -1.222404 0.074529
C  -3.414107 -1.199051 1.425074
H  1.864344 -2.849753 0.863633
H  1.056707 -1.51951 1.703336
H  3.544715 -1.342975 1.883406
H  3.679662 -1.36298 0.121794
H  2.361896 2.680934 1.490724
H  1.256732 3.025259 0.167304
H  2.982495 2.872015 -0.143071
H  -1.670578 1.354619 -2.114312
H  -0.739202 0.8737 1.304185
H  -3.205827 -0.558933 -1.894841
H  -2.077513 -0.407121 2.905373
H  -4.58513 -1.792674 -0.273627
H  -4.012437 -1.750447 2.137938
elementType: S O N C H
totalener: -1068.57162897 hartree
nucrepener: 1231.88821182 hartree
electener: -2300.45984079 hartree
oneelecener: -3908.75853488 hartree
twoeener: 1608.29869409 hartree
cpcmener: -0.03279189 hartree
kineticenergy: 1065.01140474 hartree
xcener: -83.993603654516 hartree
chargesum: 0.0000000
charge: -0.105061 -0.322654 -0.512394 -0.132044 -0.123132 0.042284 -0.098841 0.200078 0.288957 -0.265357 0.187590 -0.204939 -0.218124 -0.148708 -0.142157 -0.172459 0.125069 0.103688 0.108401 0.102774 0.104145 0.094381 0.116868 0.177019 0.161358 0.145898 0.161887 0.161954 0.163520
qa: -0.1051 -0.3227 -0.5124 -0.1320 -0.1231 0.0423 -0.0988 0.2001 0.2890 -0.2654 0.1876 -0.2049 -0.2181 -0.1487 -0.1422 -0.1725 0.1251 0.1037 0.1084 0.1028 0.1041 0.0944 0.1169 0.1770 0.1614 0.1459 0.1619 0.1620 0.1635
va: 2.2842 2.1165 1.9806 3.1458 3.9429 3.8597 3.7089 3.8724 4.2152 3.9520 3.6324 3.9090 3.9909 3.8901 3.9049 3.8844 1.0104 1.0183 0.9931 1.0051 1.0095 1.0114 0.9983 1.0146 0.9936 1.0066 0.9907 0.9883 0.9878
dispcorr: -0.013691740 hartree
energy: -1068.585320706433
dipole: 0.31623 -0.81149 -0.49526 -0.66091 -0.77800 -1.43892 8.08987 -6.22037 1.86950
magnitude: 2.41056 au
magnitude: 6.12716 debye
