program: Orca
programVersion: 4.2.1
elementType: Cl Cl O N N C C C C C C C C C C C C C C C C C C H H H H H H H H H H H H
charge: 0
multiplicity: 1
keywords: wb97x-d3
keywords: def2-TZVPP
keywords: def2/J RIJCOSX GRIDX6 NOFINALGRIDX
keywords: grid4 nofinalgrid
keywords: scfconv7
keywords: smallprint printgap noloewdin
keywords: NOSOSCF
formula: C18H12Cl2N2O
InChI: InChI=1/C18H12Cl2N2O/c19-13-9-7-12(8-10-13)14-4-1-2-6-16(14)22-18(23)15-5-3-11-21-17(15)20/h1-11,22H
35 atoms
Cl -4.763856 -3.299543 -0.994663
Cl 0.489001 1.148563 -1.770653
O  -1.18343 2.666271 1.418036
N  -0.123964 0.683361 1.404609
N  2.340138 2.94143 -1.495166
C  0.716466 -1.422002 0.529803
C  0.954131 -0.189125 1.149394
C  -0.646571 -1.861156 0.157716
C  1.800287 -2.248459 0.248958
C  2.24778 0.167382 1.514308
C  -1.622756 -2.078183 1.128115
C  -0.967136 -2.103865 -1.175685
C  3.094391 -1.873497 0.57464
C  3.315155 -0.664216 1.215528
C  -0.20809 1.996725 1.112809
C  0.946854 2.647387 0.424151
C  -2.8912 -2.51732 0.782391
C  -2.230506 -2.544829 -1.537978
C  -3.183753 -2.745871 -0.552404
C  1.611641 3.683603 1.065971
C  1.352459 2.349151 -0.87139
C  2.663379 4.315875 0.426716
C  2.996724 3.901057 -0.849868
H  1.621713 -3.202298 -0.231089
H  2.427047 1.093451 2.042735
H  -0.97779 0.282471 1.769008
H  -1.392642 -1.930189 2.17651
H  -0.224565 -1.947539 -1.947378
H  3.921686 -2.530773 0.343671
H  4.316071 -0.3694 1.500102
H  -3.634163 -2.685903 1.549653
H  -2.464168 -2.726253 -2.5780
H  1.322378 3.974054 2.067506
H  3.212735 5.11262 0.90625
H  3.816967 4.362127 -1.384245
elementType: Cl O N C H
totalener: -1798.37944926 hartree
nucrepener: 2097.46731696 hartree
electener: -3895.84676621 hartree
oneelecener: -6632.86618366 hartree
twoeener: 2737.01941745 hartree
cpcmener: -0.03572594 hartree
kineticenergy: 1793.35630863 hartree
xcener: -128.105616751994 hartree
chargesum: 0.0000000
charge: -0.098308 -0.068742 -0.501019 -0.111629 -0.304306 0.117065 0.038833 0.074574 -0.134105 -0.180545 -0.218358 -0.240150 -0.179004 -0.124980 0.353331 -0.111678 -0.154024 -0.168040 0.107858 -0.110787 0.211830 -0.150165 0.047368 0.147582 0.152304 0.181708 0.167375 0.151827 0.162667 0.164836 0.146919 0.146151 0.160326 0.166421 0.156864
qa: -0.0983 -0.0687 -0.5010 -0.1116 -0.3043 0.1171 0.0388 0.0746 -0.1341 -0.1805 -0.2184 -0.2402 -0.1790 -0.1250 0.3533 -0.1117 -0.1540 -0.1680 0.1079 -0.1108 0.2118 -0.1502 0.0474 0.1476 0.1523 0.1817 0.1674 0.1518 0.1627 0.1648 0.1469 0.1462 0.1603 0.1664 0.1569
va: 1.2072 1.2630 2.0035 3.1775 3.0545 3.4397 3.7315 3.4130 3.8771 3.9714 3.9414 3.9858 3.9232 3.8972 4.2192 3.6472 3.9929 4.0333 3.8285 3.9561 4.1808 3.9071 3.9798 1.0016 1.0027 1.0220 0.9949 1.0068 0.9892 0.9876 1.0064 1.0064 1.0031 0.9885 0.9950
dispcorr: -0.020414298 hartree
energy: -1798.399863553905
dipole: 17.13733 -14.68321 2.45411 2.35533 -2.72134 -0.36601 9.71742 -8.38784 1.32958
magnitude: 2.81503 au
magnitude: 7.15524 debye
