program: Gaussian 09
title: 000069357
version: EM64L-G09RevD.01
frameworkgroup: C1[X(C2H7NO)]
method: RPBEPBE
basis: SDD
operation: Freq
keyword: #pfreq=noraman
keyword: PBEPBE/SDD
title: #p freq=noraman PBEPBE/SDD
converged: NO NO NO NO
title: Mulliken charges:
elementType: O N C C H H H H H H H
charge: -0.288195 -0.479165 -0.191110 -0.676485 0.196483 0.196194 0.206762 0.226760 0.226783 0.290933 0.291039
chargesum: 0.00000
title: Mulliken charges with hydrogens summed into heavy atoms:
elementType: O N C C
charge: -0.288195 0.102808 0.201567 -0.016179
polarizability: 4.66080465e+01 4.17063483e-01 2.87691562e+01 1.09302012e-03 1.61486080e-02 3.07679203e+01
1716.lowfreq: -17.8128 -14.5398 0.0006 0.0008 0.0010 20.9560 100.2792 189.0470 240.2417
frequency: 100.2390 189.0224 240.1009 277.1101 453.5158 792.2729 813.0642 831.3067 1020.5894 1084.2799 1138.1353 1152.0381 1209.4501 1233.8618 1351.8429 1389.6742 1459.7964 1482.1096 1496.8227 1605.1164 2962.6393 2990.5258 3015.9581 3088.3136 3097.0161 3312.2419 3452.4915
redmass: 3.0081 1.0921 1.1510 2.9267 3.8895 4.3177 1.0785 2.2221 2.2616 1.9894 1.3686 2.0917 1.1317 1.1787 1.3044 1.2498 1.0415 1.0465 1.0791 1.0698 1.0560 1.0359 1.1081 1.0988 1.1012 1.0411 1.0991
irintensity: 0.1989 74.0487 5.2199 6.2867 13.0849 5.7189 3.2867 38.6045 38.7441 40.3048 4.4067 31.2057 0.9666 0.4591 8.5586 26.3395 10.8057 7.5018 6.2596 14.5989 57.6197 21.1089 48.1439 35.9962 48.8276 5.8546 0.1954
temp: 298.150 k
press: 1.00000 atm
elementType: 8 7 6 6 1 1 1 1 1 1 1
symmnumber: 1
zpe: 246667.2 jmol-1
zpe.correction: 0.093951 hartree
zpe.thermalcorrener: 0.099701 hartree
zpe.thermalcorrenthalpy: 0.100645 hartree
zpe.thermalcorrgfe: 0.065841 hartree
zpe.sumelectzpe: -209.961079 hartree
zpe.sumelectthermal: -209.955329 hartree
zpe.sumelectthermalent: -209.954385 hartree
zpe.sumelectthermalfe: -209.989188 hartree
dipole: -0.3870 -0.0353 0.0056
dipole: 0.3887
quadrupole: -19.8647 -27.8580 -23.8373
quadrupole: 3.1960 -0.0144 0.0156
quadrupole: 3.9886 -4.0047 0.0161 3.1960 -0.0144 0.0156
hfenergy: -210.0550294 hartree
pointgroup: C01 [X(C2H7N1O1)]
dipole: -0.1518801 0.0177069 -0.0021428 debye
dipolederiv: -0.48768 0.1439188 -0.0000916 0.0108918 -0.3846142 -0.0004489 0.0008727 0.0001744 -0.3699961 -0.1311119 -0.0894416 0.0006382 0.0014733 -0.3047951 0.0008412 0.0002755 0.0004422 -0.0351054 0.5849314 -0.1529356 -0.0002147 -0.2758021 0.4183797 0.0004047 -0.0000988 0.0001864 0.4228688 -0.168388 -0.0424659 -0.0000369 -0.011272 0.0220404 -0.0000721 -0.0000063 -0.0001032 0.0654302 -0.0066094 -0.0091927 0.0450658 0.0511851 -0.0671325 0.1107389 0.007281 0.1543314 -0.1173012 -0.0069694 -0.0091283 -0.04515 0.0511607 -0.0671271 -0.1108721 -0.0073223 -0.154536 -0.1179306 -0.0740389 0.1148885 0.0000507 0.1359724 -0.0276726 -0.0000456 0.0000384 -0.0000432 0.1121433 0.0941243 -0.0166633 0.0067281 -0.0594086 0.0108777 0.1164856 0.0377082 0.1251253 -0.0714886 0.094149 -0.0166255 -0.0067102 -0.0593529 0.011106 -0.11642 -0.0377495 -0.125038 -0.0717284 0.0506691 0.0385666 -0.0605007 0.0773192 0.1951774 0.1558585 -0.0385738 0.1063222 0.0903782 0.050924 0.0390791 0.0602212 0.077833 0.1937603 -0.1564702 0.0375749 -0.1068615 0.0927297 unknown
polarizability: 46.5759988|-0.8628828|28.8011613|-0.005797|0.0136867|30.7679629 unknown
InChI: InChI=1S/C2H7NO/c1-2-4-3/h2-3H2,1H3
charge 0 multiplicity 1
11 atoms
O  -0.493465 0.537098 0.000212
N  -1.854449 -0.092782 0.001364
C  0.511175 -0.542998 -0.000344
C  1.87703 0.149982 0.000016
H  0.373979 -1.180424 0.896748
H  0.374373 -1.179466 -0.898246
H  2.681796 -0.608211 -0.000234
H  1.994826 0.785818 -0.89487
H  1.994556 0.784923 0.895563
H  -2.310864 0.295382 -0.844318
H  -2.312056 0.300679 0.843811
