program: Orca
programVersion: 4.2.1
elementType: Cl Cl O N N C C C C C C C C C C C C C C C C C C H H H H H H H H H H H H
charge: 0
multiplicity: 1
keywords: wb97x-d3
keywords: def2-TZVPP
keywords: def2/J RIJCOSX GRIDX6 NOFINALGRIDX
keywords: grid4 nofinalgrid
keywords: scfconv7
keywords: smallprint printgap noloewdin
keywords: NOSOSCF
formula: C18H12Cl2N2O
InChI: InChI=1/C18H12Cl2N2O/c19-13-9-7-12(8-10-13)14-4-1-2-6-16(14)22-18(23)15-5-3-11-21-17(15)20/h1-11,22H
35 atoms
Cl -4.44521 -2.188826 1.052612
Cl -1.181364 1.432537 1.024933
O  2.895128 1.686576 0.464243
N  1.352023 0.340656 -0.517594
N  -1.206218 3.835636 0.072765
C  1.375503 -2.066713 -0.35333
C  2.072419 -0.869226 -0.548306
C  -0.068556 -2.074478 -0.015508
C  2.056713 -3.273609 -0.478446
C  3.434086 -0.898146 -0.841676
C  -0.490481 -1.775455 1.277011
C  -1.021866 -2.407228 -0.973667
C  3.413272 -3.303468 -0.759193
C  4.098529 -2.110341 -0.93504
C  1.793666 1.518377 -0.031749
C  0.875673 2.689002 -0.208662
C  -1.833889 -1.814998 1.614705
C  -2.371239 -2.442461 -0.653764
C  -2.763129 -2.14598 0.641355
C  1.413237 3.831277 -0.793093
C  -0.447356 2.776487 0.214835
C  0.62349 4.953253 -0.96525
C  -0.684207 4.904774 -0.518634
H  1.514071 -4.199251 -0.335207
H  3.976557 0.016605 -1.025846
H  0.398356 0.297309 -0.847428
H  0.235981 -1.514233 2.035399
H  -0.713475 -2.640567 -1.984594
H  3.929147 -4.250406 -0.842153
H  5.155804 -2.117445 -1.163663
H  -2.147733 -1.587089 2.624131
H  -3.102245 -2.699036 -1.408134
H  2.443165 3.833396 -1.124032
H  1.013512 5.846676 -1.430073
H  -1.340346 5.757954 -0.630193
elementType: Cl O N C H
totalener: -1798.38057864 hartree
nucrepener: 2072.23003530 hartree
electener: -3870.61061393 hartree
oneelecener: -6582.44917585 hartree
twoeener: 2711.83856191 hartree
cpcmener: -0.03186741 hartree
kineticenergy: 1793.35019646 hartree
xcener: -128.102256049328 hartree
chargesum: 0.0000000
charge: -0.098559 -0.066024 -0.504226 -0.159834 -0.314561 0.126768 0.120699 -0.016233 -0.156681 -0.185932 -0.203184 -0.160161 -0.179376 -0.144394 0.412745 -0.089592 -0.202745 -0.176351 0.155068 -0.100340 0.180278 -0.171355 0.057759 0.145030 0.147386 0.185843 0.148823 0.148934 0.161984 0.162743 0.151831 0.146301 0.153373 0.165610 0.158374
qa: -0.0986 -0.0660 -0.5042 -0.1598 -0.3146 0.1268 0.1207 -0.0162 -0.1567 -0.1859 -0.2032 -0.1602 -0.1794 -0.1444 0.4127 -0.0896 -0.2027 -0.1764 0.1551 -0.1003 0.1803 -0.1714 0.0578 0.1450 0.1474 0.1858 0.1488 0.1489 0.1620 0.1627 0.1518 0.1463 0.1534 0.1656 0.1584
va: 1.2074 1.2659 2.0007 3.2522 3.0422 3.4239 3.7527 3.4673 3.9149 3.9833 3.9089 3.9548 3.9200 3.9201 4.1087 3.6544 3.9211 4.0030 3.7667 3.9637 4.2232 3.9321 3.9744 1.0044 1.0183 1.0098 1.0108 1.0048 0.9898 0.9898 1.0036 1.0057 1.0084 0.9899 0.9948
dispcorr: -0.019048173 hartree
energy: -1798.399626808320
dipole: 18.30173 -17.80297 0.49876 -2.02254 2.16528 0.14274 -8.95478 7.02805 -1.92673
magnitude: 1.99535 au
magnitude: 5.07178 debye
