program: Orca
programVersion: 4.2.1
elementType: Cl Cl O N N C C C C C C C C C C C C C C C C C C H H H H H H H H H H H H
charge: 0
multiplicity: 1
keywords: wb97x-d3
keywords: def2-TZVPP
keywords: def2/J RIJCOSX GRIDX6 NOFINALGRIDX
keywords: grid4 nofinalgrid
keywords: scfconv7
keywords: smallprint printgap noloewdin
keywords: NOSOSCF
formula: C18H12Cl2N2O
InChI: InChI=1/C18H12Cl2N2O/c19-13-9-7-12(8-10-13)14-4-1-2-6-16(14)22-18(23)15-5-3-11-21-17(15)20/h1-11,22H
35 atoms
Cl -4.741617 -3.583812 -1.025644
Cl 1.137996 1.142971 -1.894882
O  -1.338478 2.746082 0.812059
N  -0.269914 0.78972 1.059775
N  2.734031 3.084253 -1.292778
C  0.596966 -1.43055 0.65274
C  0.813946 -0.106398 1.059517
C  -0.733072 -1.927688 0.232888
C  1.669248 -2.319684 0.690712
C  2.06539 0.282743 1.525736
C  -1.254012 -3.07552 0.830511
C  -1.483023 -1.305459 -0.765317
C  2.928751 -1.917005 1.102823
C  3.123099 -0.611269 1.525665
C  -0.310085 2.09282 0.714897
C  0.939085 2.772105 0.25531
C  -2.482685 -3.590787 0.450744
C  -2.712597 -1.809741 -1.157392
C  -3.204077 -2.950377 -0.543516
C  1.367951 3.885771 0.968136
C  1.665111 2.447368 -0.884905
C  2.50078 4.565913 0.558648
C  3.156458 4.119365 -0.574025
H  1.514043 -3.342097 0.37071
H  2.215908 1.278711 1.917023
H  -1.176149 0.397918 1.28464
H  -0.701052 -3.573398 1.616448
H  -1.108093 -0.422988 -1.264645
H  3.747767 -2.623131 1.106558
H  4.092101 -0.288168 1.880887
H  -2.869967 -4.477952 0.932096
H  -3.273503 -1.316639 -1.939102
H  0.828322 4.201347 1.851067
H  2.865928 5.42416 1.103017
H  4.049785 4.615763 -0.929108
elementType: Cl O N C H
totalener: -1798.37916953 hartree
nucrepener: 2078.29544981 hartree
electener: -3876.67461935 hartree
oneelecener: -6594.28133389 hartree
twoeener: 2717.60671454 hartree
cpcmener: -0.03327999 hartree
kineticenergy: 1793.35050736 hartree
xcener: -128.106343284558 hartree
chargesum: -0.0000000
charge: -0.097798 -0.062707 -0.499906 -0.126793 -0.305540 0.195248 -0.004110 0.091164 -0.189397 -0.157734 -0.232324 -0.239989 -0.162478 -0.142897 0.363037 -0.119654 -0.152899 -0.157469 0.104287 -0.106422 0.215652 -0.152497 0.050756 0.149206 0.158258 0.183134 0.152963 0.148074 0.162359 0.164767 0.146270 0.145154 0.155496 0.166980 0.157809
qa: -0.0978 -0.0627 -0.4999 -0.1268 -0.3055 0.1952 -0.0041 0.0912 -0.1894 -0.1577 -0.2323 -0.2400 -0.1625 -0.1429 0.3630 -0.1197 -0.1529 -0.1575 0.1043 -0.1064 0.2157 -0.1525 0.0508 0.1492 0.1583 0.1831 0.1530 0.1481 0.1624 0.1648 0.1463 0.1452 0.1555 0.1670 0.1578
va: 1.2079 1.2601 2.0067 3.1788 3.0567 3.3968 3.7582 3.3944 3.9258 3.9079 3.9999 3.9581 3.9053 3.9197 4.2010 3.6521 3.9872 4.0665 3.8235 3.9536 4.1633 3.9149 3.9784 1.0010 1.0006 1.0158 1.0012 1.0226 0.9890 0.9877 1.0058 1.0073 1.0066 0.9885 0.9947
dispcorr: -0.020040756 hartree
energy: -1798.399210288834
dipole: 14.39928 -12.33933 2.05995 3.19474 -3.33834 -0.14359 11.52109 -9.80540 1.71569
magnitude: 2.68470 au
magnitude: 6.82395 debye
