program: Orca
programVersion: 4.2.1
elementType: Cl Cl F F F O N N N C C C C C C C C C C C C C C C C C C H H H H H H H H H H H H
charge: 0
multiplicity: 1
keywords: wb97x-d3
keywords: def2-TZVPP
keywords: def2/J RIJCOSX GRIDX6 NOFINALGRIDX
keywords: grid4 nofinalgrid
keywords: scfconv7
keywords: smallprint printgap noloewdin
keywords: NOSOSCF
formula: C18H12Cl2F3N3O
InChI: InChI=1/C18H12Cl2F3N3O/c1-26-8-12(16(25-26)17(22)23)18(27)24-15-5-3-10(21)7-11(15)9-2-4-13(19)14(20)6-9/h2-8,17,24H,1H3
39 atoms
Cl -0.536833 2.931091 1.751229
Cl 1.207826 5.002203 0.147744
F  5.250947 -3.075565 0.309441
F  -3.892629 -2.849478 1.363422
F  -3.717468 -3.399655 -0.741575
O  -1.02127 -2.72139 0.505301
N  0.162676 -1.312369 -0.819403
N  -3.398149 0.923922 -0.614501
N  -4.241519 -0.066494 -0.352411
C  2.442396 -0.852404 -0.138026
C  1.452455 -1.776935 -0.496424
C  -2.131035 -0.841733 -0.383339
C  2.147292 0.594269 -0.045825
C  -3.496767 -1.140047 -0.196345
C  -0.971081 -1.722009 -0.19174
C  -2.127182 0.512891 -0.65315
C  3.735082 -1.302895 0.113804
C  1.759737 -3.130407 -0.566018
C  1.097961 1.055693 0.745355
C  2.913657 1.519756 -0.748606
C  4.005587 -2.653121 0.046893
C  3.038415 -3.580644 -0.282009
C  -4.1687 -2.429821 0.09887
C  -3.87721 2.267235 -0.858524
C  0.80296 2.407073 0.803881
C  2.63095 2.873153 -0.677776
C  1.569005 3.322657 0.090419
H  0.114108 -0.477745 -1.384159
H  -1.323344 1.201336 -0.860389
H  4.515688 -0.60512 0.388806
H  1.005885 -3.841751 -0.869736
H  0.511416 0.366391 1.338012
H  3.730909 1.185875 -1.373623
H  -5.251034 -2.350503 -0.007779
H  3.277323 -4.634119 -0.335421
H  -3.213918 2.98274 -0.379041
H  -3.917783 2.474443 -1.92584
H  -4.870575 2.368123 -0.433617
H  3.230453 3.580701 -1.233613
elementType: Cl F O N C H
totalener: -2152.71796781 hartree
nucrepener: 2770.15559754 hartree
electener: -4922.87356535 hartree
oneelecener: -8467.51184359 hartree
twoeener: 3544.63827825 hartree
cpcmener: -0.04434255 hartree
kineticenergy: 2146.65190193 hartree
xcener: -155.483172522870 hartree
chargesum: -0.0000000
charge: -0.065702 -0.065785 -0.222323 -0.221640 -0.223168 -0.497002 -0.182018 0.111746 -0.294302 0.098840 0.112782 -0.114172 0.072794 -0.010629 0.345287 -0.053548 -0.200787 -0.165070 -0.242457 -0.201271 0.293686 -0.189962 0.334134 -0.129249 0.047301 -0.135249 0.065768 0.184515 0.187397 0.141895 0.147751 0.155841 0.154898 0.107198 0.155506 0.103802 0.129892 0.116760 0.146545
qa: -0.0657 -0.0658 -0.2223 -0.2216 -0.2232 -0.4970 -0.1820 0.1117 -0.2943 0.0988 0.1128 -0.1142 0.0728 -0.0106 0.3453 -0.0535 -0.2008 -0.1651 -0.2425 -0.2013 0.2937 -0.1900 0.3341 -0.1292 0.0473 -0.1352 0.0658 0.1845 0.1874 0.1419 0.1478 0.1558 0.1549 0.1072 0.1555 0.1038 0.1299 0.1168 0.1465
va: 1.2554 1.2552 1.0568 1.0456 1.0498 2.0146 3.2194 3.4049 2.9475 3.5221 3.7049 3.6761 3.4775 4.0333 4.2006 4.0400 3.8959 3.9667 3.9447 3.9938 3.9198 3.9160 4.1855 3.8658 3.8936 3.9878 3.9108 1.0023 0.9780 1.0080 1.0153 1.0100 0.9982 0.9943 0.9965 1.0033 0.9880 1.0048 1.0062
dispcorr: -0.022238080 hartree
energy: -2152.740205892035
dipole: -0.62527 1.50050 0.87523 0.08978 3.09716 3.18694 -10.34616 7.99506 -2.35110
magnitude: 4.05589 au
magnitude: 10.30926 debye
